program: Gaussian 09
title: 000040146
version: EM64L-G09RevD.01
frameworkgroup: C1[X(C15H16N2O)]
method: RPBEPBE
basis: SDD
operation: Freq
keyword: #p
keyword: freq=noraman
keyword: PBEPBE/SDD
title: #p freq=noraman PBEPBE/SDD
converged: YES YES NO NO
title: Mulliken charges:
elementType: O N N C C C C C C C C C C C C C C C H H H H H H H H H H H H H H H H
charge: -0.277275 -0.399400 -0.007011 0.309186 0.464796 0.466470 -0.531840 -0.568626 -0.493618 -0.530854 0.149344 0.496314 -0.814224 -0.808527 -0.372464 -0.317020 -0.324490 -0.335464 0.278695 0.218159 0.274200 0.228181 0.238073 0.308890 0.234060 0.221793 0.233021 0.223238 0.237096 0.233553 0.233570 0.251201 0.240278 0.240693
chargesum: 0.00000
title: Mulliken charges with hydrogens summed into heavy atoms:
elementType: O N N C C C C C C C C C C C C C C C
charge: -0.277275 -0.090510 -0.007011 0.309186 0.464796 0.466470 -0.253144 -0.350467 0.008763 -0.292781 0.149344 0.496314 -0.125349 -0.114640 -0.138894 -0.065818 -0.084212 -0.094771
polarizability: 2.41690897e+02 -1.48362853e+01 1.61895135e+02 1.63956661e+01 -8.66112525e+00 1.34521425e+02
1716.lowfreq: -20.3809 -3.2396 0.0003 0.0005 0.0008 4.9328 8.2643 12.5064 24.0312
frequency: -20.2539 12.0269 23.9392 31.1741 32.5279 46.4338 113.6547 130.2051 186.8312 206.6123 220.9091 225.3055 240.4319 274.0110 299.0546 368.2291 373.4094 423.8697 455.6997 493.7654 500.4540 517.8994 536.9620 551.1776 573.8347 609.4532 661.9479 689.5792 724.3739 740.1494 748.2859 804.2371 827.8737 871.8565 883.7993 888.3719 899.6006 943.5816 946.9141 960.2559 961.6041 977.0909 981.1111 989.0110 1018.5735 1019.9188 1047.0362 1053.9319 1061.4524 1064.4211 1088.7496 1143.2819 1176.5786 1213.2922 1224.9139 1226.2878 1238.4277 1294.5569 1297.9776 1315.3595 1328.7991 1361.3423 1382.3297 1397.5742 1399.1434 1405.0242 1428.0191 1436.2600 1459.5291 1468.4143 1469.7386 1472.6142 1477.5264 1482.2116 1495.3326 1560.2783 1582.6814 1588.0935 1610.2798 1618.7918 2978.0215 2978.7132 2980.4771 3035.2438 3058.5646 3060.3343 3083.8026 3088.9607 3110.3547 3113.9686 3123.7393 3131.4263 3145.8253 3146.7213 3158.7662 3563.2078
redmass: 1.0172 3.8372 4.1183 1.9420 1.6089 6.4325 4.0286 4.6598 3.6488 3.7591 4.1923 3.1006 4.6736 3.2350 2.8943 2.4858 5.7808 3.0079 3.5628 4.1610 4.8176 2.9966 4.3307 4.7385 1.3246 3.2549 6.9300 2.8027 4.6931 3.3779 3.6762 1.9860 2.1303 1.6074 2.7426 1.3513 1.3237 1.4461 3.2739 6.6764 1.3886 1.5196 1.5954 5.7025 2.0839 1.5328 1.5402 1.6225 2.2200 3.4135 1.5967 1.7371 1.4617 1.6600 1.7669 1.4112 1.7326 1.2436 3.0679 4.5509 1.7530 1.3633 6.6303 1.2372 1.2663 2.0052 2.1527 2.7561 1.2922 1.5995 1.0460 1.0740 1.2158 1.2552 1.7820 6.5631 6.5375 5.5716 5.6964 6.4009 1.0384 1.0375 1.0590 1.1012 1.0977 1.0951 1.0990 1.1000 1.0908 1.0915 1.0874 1.0883 1.0920 1.0970 1.0978 1.0773
irintensity: 0.6824 0.2531 0.1142 1.2560 0.3646 7.2768 3.0982 0.9146 0.7209 4.9279 2.8496 0.4490 5.1921 3.2902 2.3412 0.5387 4.8585 13.6456 7.4316 34.1592 2.0034 2.0106 2.2435 3.2940 80.4941 43.5340 0.1199 5.7620 1.4965 25.4018 0.1239 29.7616 24.9616 26.9223 7.2293 0.9332 2.1111 4.1054 4.4374 3.6971 2.3220 2.9849 6.5943 1.0582 8.9344 2.1056 1.9617 26.8746 9.3667 2.4550 1.5689 0.1492 11.6681 1.1568 22.2950 11.6488 162.9702 0.5587 4.4894 70.4148 37.9066 5.9030 4.8739 19.2100 8.1112 24.3510 3.5494 5.2566 34.1434 3.5579 15.7142 12.5507 97.2506 95.1497 140.4376 12.3843 177.3207 60.3063 0.4431 10.0855 39.7174 29.0185 47.7060 20.9862 17.1522 22.2789 15.6050 15.3682 31.3654 8.1617 7.6239 13.7641 2.0739 40.6482 6.2168 11.9770
temp: 298.150 k
press: 1.00000 atm
elementType: 8 7 7 6 6 6 6 6 6 6 6 6 6 6 6 6 6 6 1 1 1 1 1 1 1 1 1 1 1 1 1 1 1 1
symmnumber: 1
zpe: 721434.2 jmol-1
zpe.correction: 0.274780 hartree
zpe.thermalcorrener: 0.291234 hartree
zpe.thermalcorrenthalpy: 0.292178 hartree
zpe.thermalcorrgfe: 0.226681 hartree
zpe.sumelectzpe: -764.653726 hartree
zpe.sumelectthermal: -764.637272 hartree
zpe.sumelectthermalent: -764.636328 hartree
zpe.sumelectthermalfe: -764.701825 hartree
dipole: 3.1608 3.4056 -0.2170
dipole: 4.6514
quadrupole: -106.7157 -104.3820 -109.2184
quadrupole: -1.4797 17.5854 -8.4562
quadrupole: 0.0563 2.3900 -2.4464 -1.4797 17.5854 -8.4562
hfenergy: -764.9285057 hartree
pointgroup: C01 [X(C15H16N2O1)]
dipole: 1.3554973 1.1527016 0.4275866 debye
polarizability: 237.7922861|-26.5206423|168.068377|8.3260027|3.2966688|132.246794 unknown
InChI: InChI=1S/C15H16N2O/c1-11-7-12(2)9-14(8-11)15(18)17-10-13-3-5-16-6-4-13/h3-9,17H,10H2,1-2H3
charge 0 multiplicity 1
34 atoms
O  0.07952 -1.155953 -2.027848
N  -0.60611 0.692849 -0.797674
N  -5.168592 0.037309 1.522363
C  1.69837 -0.137962 -0.519748
C  3.455029 1.094729 0.691442
C  3.808571 -1.272936 0.048166
C  2.525375 -1.285181 -0.54852
C  2.173368 1.05111 0.094449
C  -1.951336 0.710867 -1.386481
C  4.254768 -0.077171 0.663118
C  0.347777 -0.245665 -1.17954
C  -3.059182 0.489447 -0.364023
C  3.976987 2.367462 1.336641
C  4.676714 -2.519186 0.042624
C  -4.238425 1.272805 -0.377925
C  -2.960009 -0.52698 0.619513
C  -5.254573 1.01372 0.570803
C  -4.024651 -0.714188 1.527718
H  2.146321 -2.18022 -1.054305
H  1.575575 1.971538 0.077272
H  -1.953023 -0.104605 -2.135986
H  -2.122655 1.662568 -1.926215
H  5.252711 -0.051913 1.12098
H  -0.397546 1.347097 -0.042888
H  4.915254 2.704575 0.857938
H  3.246541 3.19124 1.260523
H  4.197465 2.211683 2.409359
H  5.748459 -2.268559 0.128232
H  4.423264 -3.182417 0.892353
H  4.532937 -3.104682 -0.8822
H  -4.370031 2.075158 -1.113273
H  -2.070259 -1.163068 0.673147
H  -6.175547 1.608048 0.580721
H  -3.974567 -1.495316 2.294864
