program: Gaussian 09
title: 000040330
version: EM64L-G09RevD.01
frameworkgroup: C1[X(C23H28F3NOS)]
method: RPBEPBE
basis: SDD
operation: Freq
keyword: #p
keyword: freq=noraman
keyword: PBEPBE/SDD
title: #p freq=noraman PBEPBE/SDD
converged: YES YES NO NO
title: Mulliken charges:
elementType: S F F F O N C C C C C C C C C C C C C C C C C C C C C C C H H H H H H H H H H H H H H H H H H H H H H H H H H H H
charge: 0.240476 -0.167005 -0.167946 -0.167515 -0.453960 -0.103688 -0.429003 -0.272416 -0.369659 -0.352785 0.783875 -0.363829 -0.357082 -0.857060 0.474820 -0.701465 0.269262 0.482617 -0.337353 -0.341134 -0.248534 -0.540498 -0.459683 -0.694209 -0.693799 0.320058 -0.536407 -0.348798 0.227517 0.239271 0.183111 0.214121 0.196706 0.197462 0.194320 0.182037 0.196736 0.189384 0.215383 0.184532 0.272889 0.180114 0.239017 0.189845 0.192445 0.336930 0.246438 0.261608 0.252917 0.220797 0.212900 0.202193 0.210194 0.212380 0.216313 0.265130 0.260030
chargesum: 0.00000
title: Mulliken charges with hydrogens summed into heavy atoms:
elementType: S F F F O N C C C C C C C C C C C C C C C C C C C C C C C
charge: 0.240476 -0.167005 -0.167946 -0.167515 -0.117030 -0.103688 -0.006621 -0.058296 0.024509 0.023572 0.783875 0.022290 0.042833 -0.857060 0.474820 -0.428576 0.269262 0.482617 0.081777 0.041156 -0.002095 -0.278890 -0.206766 -0.058318 -0.054912 0.320058 -0.271277 -0.088768 0.227517
polarizability: 3.82052770e+02 -1.97523219e+01 2.84789203e+02 3.58429734e+01 -3.28806390e-01 1.93381682e+02
1716.lowfreq: -14.6878 -5.1777 -0.0012 -0.0007 0.0019 3.2408 6.0324 10.8282 23.5319
frequency: -9.0919 10.2170 23.5151 26.2363 27.9722 49.0488 49.6530 57.9261 66.4624 85.0157 98.6474 102.3536 112.4139 126.7304 136.9869 139.8066 148.3660 159.7102 213.2083 223.1863 225.6663 228.1833 236.9398 242.2424 260.1469 271.3881 294.1949 299.4697 307.5076 309.8898 331.4681 359.0499 373.6295 378.5882 385.8506 415.3656 442.3015 462.7395 477.1569 481.9900 495.3968 503.4642 517.2481 531.1023 546.7480 602.2199 606.2080 613.4099 647.5261 653.4040 665.1055 696.0315 708.7735 730.9395 734.9609 745.2350 770.9377 781.1070 800.7696 816.8183 821.0908 827.1950 844.5414 881.8640 895.0075 899.8096 902.5928 912.9908 916.2925 921.9996 928.1279 948.2443 969.8812 975.0979 980.9176 991.6309 1018.9945 1023.9415 1034.9947 1038.9056 1042.8085 1057.1538 1063.9192 1070.2079 1081.3685 1100.8921 1105.3617 1116.7722 1121.3403 1153.0807 1161.0217 1184.1577 1188.5888 1222.2672 1223.9129 1244.2028 1245.8676 1250.6295 1260.0328 1263.9087 1280.2368 1280.7660 1283.0187 1287.1414 1287.3412 1301.5305 1309.0594 1311.0936 1342.8313 1354.3208 1359.1727 1361.9038 1367.1788 1370.2674 1375.0201 1386.4704 1391.9023 1400.4496 1420.3706 1440.6496 1450.1521 1463.9412 1466.5039 1469.0840 1469.9590 1474.3389 1475.9272 1476.4498 1476.9723 1479.9046 1486.8263 1489.4970 1500.0854 1526.6192 1570.9456 1595.3149 1634.6074 2813.1202 2839.2626 2864.6847 2959.6412 2961.6929 2962.6579 2969.8031 2969.9816 2973.7186 2980.4435 3002.9236 3006.1229 3008.7842 3035.3571 3041.6640 3049.2122 3051.7775 3068.3773 3069.1434 3070.6506 3073.3686 3137.4216 3145.3016 3165.2502 3167.6749 3180.2080 3235.9537 3542.9297
redmass: 5.1822 15.7018 4.6490 3.6444 4.4580 4.4605 3.6400 1.7338 3.4376 2.1817 4.3284 8.2155 3.1116 3.0310 7.4041 3.5011 4.9847 2.7979 2.4053 1.7834 2.2332 1.5683 5.9437 2.6790 3.4885 2.8060 2.5407 2.1297 1.6963 3.2551 4.8742 4.9838 8.0947 6.6809 4.0541 3.8790 2.5592 4.2797 5.6428 5.2583 3.9064 3.3065 7.3066 5.5546 3.2030 3.4886 7.2958 9.1506 4.1720 6.5175 7.5148 1.9305 6.6899 1.1921 1.1126 2.4139 5.0303 1.6583 1.4550 2.0856 1.9028 1.5296 4.2526 1.6192 1.4022 1.7237 5.9101 1.5393 1.9222 2.1359 1.4235 1.3898 3.8980 1.4399 8.7897 2.7366 6.0604 3.3808 3.2666 4.6942 3.3632 2.8786 2.4836 2.3873 2.3037 1.9083 1.1800 1.9303 2.2534 1.8744 1.5347 1.3804 1.8310 1.3512 1.3394 1.3081 1.3752 1.7862 1.7304 1.4060 1.4792 2.0293 1.2642 1.1333 1.1906 1.2507 1.2806 1.6165 1.5155 1.7870 2.1389 1.3313 1.5757 2.5033 1.6839 1.2157 1.2307 1.9830 5.5498 2.8811 1.2384 1.2478 1.0855 1.8465 1.3188 1.0600 1.0796 1.0456 1.0684 1.0687 1.0834 1.0886 4.3003 5.5112 8.6671 6.3205 6.7105 1.0714 1.0707 1.0714 1.0840 1.0589 1.0589 1.0498 1.0527 1.0368 1.0620 1.0849 1.0991 1.0956 1.0921 1.0953 1.1015 1.0873 1.0996 1.0998 1.1007 1.0994 1.0888 1.0910 1.0939 1.0947 1.0911 1.1000 1.0656
irintensity: 0.0696 0.0764 0.0200 0.0094 0.0418 0.1509 0.2420 0.0596 0.3562 0.2353 0.0960 0.6364 1.3622 1.5477 0.9157 2.0165 1.3864 0.5544 5.6504 0.6498 0.6900 0.6076 1.4311 0.3538 2.0632 18.9814 33.2401 24.0494 49.5049 6.3300 5.3517 9.0903 7.6692 5.0221 2.2832 4.0658 1.2635 9.6597 7.0890 2.4488 6.6629 4.2264 2.6537 0.5046 3.8404 1.4329 7.6918 11.9079 1.2945 10.4830 4.3444 45.0605 4.1604 2.7169 14.8742 32.4731 45.7638 6.4504 5.0130 0.5649 0.7968 31.4440 10.7004 5.4513 0.2838 10.4394 31.8683 118.9250 9.4109 13.9820 4.5779 9.9190 22.9249 5.3735 188.0513 30.5905 122.7257 11.8437 21.7621 225.7101 16.6256 7.9569 19.9135 2.1898 41.4966 14.6956 23.3672 0.1550 13.4966 15.6966 9.0902 40.4866 6.9307 22.8067 0.9612 5.6300 13.4319 279.0498 4.0732 11.6748 12.9147 88.0612 28.2658 6.9927 7.0667 7.9253 3.7972 50.6837 0.4589 15.2221 40.2900 2.7678 7.7370 9.9699 1.5037 8.6378 10.8635 9.4117 2.6581 4.7341 7.9030 17.9855 3.5781 30.9575 14.3315 10.2402 12.3464 4.6126 4.4733 3.6897 15.5099 12.2501 2.2212 0.3369 1.3231 5.9554 20.0440 103.3978 120.5965 171.7962 29.5104 31.9337 17.1366 71.2895 14.4275 27.9177 31.7756 34.9309 2.0731 22.5076 8.2411 16.5483 41.2771 23.4540 63.5027 53.1882 113.5606 60.5139 4.5436 2.0636 3.6101 3.3038 2.9447 0.9244 4.0840
temp: 298.150 k
press: 1.00000 atm
elementType: 16 9 9 9 8 7 6 6 6 6 6 6 6 6 6 6 6 6 6 6 6 6 6 6 6 6 6 6 6 1 1 1 1 1 1 1 1 1 1 1 1 1 1 1 1 1 1 1 1 1 1 1 1 1 1 1 1
symmnumber: 1
zpe: 1205029.6 jmol-1
zpe.correction: 0.458972 hartree
zpe.thermalcorrener: 0.488045 hartree
zpe.thermalcorrenthalpy: 0.488989 hartree
zpe.thermalcorrgfe: 0.396447 hartree
zpe.sumelectzpe: -1718.639684 hartree
zpe.sumelectthermal: -1718.610610 hartree
zpe.sumelectthermalent: -1718.609666 hartree
zpe.sumelectthermalfe: -1718.702208 hartree
dipole: -6.5094 -1.3794 0.0274
dipole: 6.6540
quadrupole: -196.2585 -162.8279 -187.5660
quadrupole: -0.1046 -0.5091 -2.4800
quadrupole: -14.0410 19.3896 -5.3486 -0.1046 -0.5091 -2.4800
hfenergy: -1719.0986553 hartree
pointgroup: C01 [X(C23H28F3N1O1S1)]
dipole: -2.602979 0.2424871 0.1380655 debye
polarizability: 377.8156715|43.7316456|255.7383408|-7.8309831|46.5949381|226.6696426 unknown
InChI: InChI=1S/C23H28F3NOS/c1-3-5-10-27(11-6-4-2)15-21(28)20-13-16-7-8-17(23(24,25)26)14-19(16)18-9-12-29-22(18)20/h7-9,12-14,21,28H,3-6,10-11,15H2,1-2H3
charge 0 multiplicity 1
57 atoms
S  -1.599248 -2.394711 0.10803
F  6.61013 0.327012 0.715469
F  5.805159 -0.835055 -1.062861
F  5.910494 1.430113 -1.129371
O  -1.942558 0.401886 3.62052
N  -3.281359 1.100496 0.13222
C  -2.894023 1.325075 1.536943
C  -2.13331 0.126045 2.181051
C  -3.211162 2.340622 -0.691572
C  -4.564034 0.35863 0.001021
C  -0.744905 -0.072159 1.596679
C  -1.772269 2.70323 -1.121929
C  -4.727073 -0.368752 -1.349578
C  -0.444546 -1.118296 0.675449
C  0.844019 -1.301672 0.10412
C  0.292275 0.796517 1.94503
C  1.905516 -0.38811 0.453993
C  1.611452 0.6703 1.396531
C  -1.16423 1.69806 -2.124802
C  -6.03936 -1.183356 -1.421632
C  0.905605 -2.447892 -0.7798
C  3.223076 -0.492427 -0.083346
C  2.65774 1.578157 1.766326
C  0.299445 2.026937 -2.487033
C  -6.222199 -1.895247 -2.779354
C  4.21721 0.41459 0.296463
C  -0.286791 -3.130831 -0.883011
C  3.938467 1.462424 1.230678
C  5.595847 0.325251 -0.282857
H  -2.233017 2.207574 1.602796
H  -3.788453 1.544612 2.180608
H  -2.734186 -0.799029 2.050876
H  -3.673504 3.20464 -0.151278
H  -3.81835 2.180479 -1.601157
H  -4.598406 -0.402564 0.805442
H  -5.444097 1.033293 0.169566
H  -1.116296 2.765538 -0.229308
H  -1.785865 3.718632 -1.570424
H  -3.855995 -1.035952 -1.49444
H  -4.711711 0.360042 -2.184286
H  0.093496 1.5782 2.686013
H  -1.78318 1.686245 -3.046192
H  -1.230492 0.68437 -1.687457
H  -6.902923 -0.511247 -1.237477
H  -6.049825 -1.935039 -0.605775
H  -2.819696 0.646201 4.01418
H  1.804083 -2.759515 -1.316786
H  3.463249 -1.285638 -0.79658
H  2.43548 2.374132 2.485576
H  0.944226 2.002022 -1.588173
H  0.708274 1.299827 -3.212772
H  0.386217 3.035685 -2.934713
H  -6.249934 -1.16402 -3.609198
H  -5.386268 -2.592425 -2.976463
H  -7.162147 -2.476319 -2.809354
H  -0.514428 -4.019268 -1.469605
H  4.73178 2.157784 1.521302
