program: Gaussian 09
title: 000040200
version: EM64L-G09RevD.01
frameworkgroup: C1[X(C20H16O9)]
method: RPBEPBE
basis: SDD
operation: Freq
keyword: #pfreq=noraman
keyword: PBEPBE/SDD
title: #p freq=noraman PBEPBE/SDD
converged: YES YES NO NO
title: Mulliken charges:
elementType: O O O O O O O O O C C C C C C C C C C C C C C C C C C C C H H H H H H H H H H H H H H H H
charge: -0.406815 -0.426753 -0.253177 -0.467461 -0.188013 -0.391886 -0.168330 -0.411081 -0.242221 -0.225452 0.249895 0.088853 -0.468066 0.369517 0.067056 0.194669 -0.682509 0.075660 0.108749 0.362210 -0.321475 -0.318609 -0.098027 0.178371 -0.622718 0.372679 -0.513255 0.298320 -0.749820 0.281672 0.295599 0.204780 0.286237 0.241658 0.219938 0.164358 0.289610 0.289280 0.412366 0.374427 0.413114 0.369241 0.252394 0.246495 0.248520
chargesum: 0.00000
title: Mulliken charges with hydrogens summed into heavy atoms:
elementType: O O O O O O O O O C C C C C C C C C C C C C C C C C C C C
charge: 0.005551 -0.052325 -0.253177 -0.467461 -0.188013 0.021228 -0.168330 -0.041840 -0.242221 0.056221 0.249895 0.088853 0.032312 0.369517 0.067056 0.194669 -0.396271 0.075660 0.108749 0.362210 -0.321475 0.142987 0.066331 0.178371 -0.333108 0.372679 -0.223974 0.298320 -0.002412
polarizability: 4.26672796e+02 -3.95832038e+00 2.64893885e+02 -4.06888358e+01 -1.10481499e+01 1.55258657e+02
1716.lowfreq: -25.8383 -6.7895 -0.0002 0.0004 0.0008 3.7327 4.6471 17.6342 22.4466
frequency: -25.4212 17.4385 22.1983 29.4044 42.2503 55.1161 62.5116 67.0262 80.9814 96.5706 115.6609 134.0545 145.8973 163.7335 180.1946 184.1311 203.6347 229.1819 230.2080 266.8805 269.2621 280.3193 312.2825 314.7224 338.4612 351.9609 361.1191 371.4248 391.5877 405.4089 418.2140 425.5084 436.1379 452.1944 468.1931 474.5086 484.7118 512.9279 527.7943 555.3245 568.9285 576.9472 599.0619 601.3065 605.6658 613.7639 618.9820 631.9638 684.0404 711.8256 718.9150 736.0183 748.0518 762.7299 773.2380 810.9473 865.1857 871.2107 876.0064 893.2216 911.2484 921.5289 926.2267 934.2683 956.7892 966.6375 988.9564 997.9340 1004.6150 1026.2392 1041.6515 1058.0153 1073.6014 1093.0330 1101.5474 1131.9615 1169.4662 1179.8888 1193.5044 1196.9015 1200.6122 1213.3668 1224.4904 1245.0106 1281.9751 1305.6115 1317.1765 1322.2022 1337.8714 1345.7713 1349.1823 1371.6208 1383.0529 1395.8662 1399.0061 1411.4488 1425.6211 1444.3589 1450.5843 1452.5634 1454.2192 1455.1873 1465.4564 1467.0260 1503.4709 1539.1750 1567.9335 1573.9976 1597.2518 1608.1566 1647.4704 1654.4870 1656.9970 2723.0878 2825.7378 2856.4212 2965.3053 2976.1379 3004.6526 3027.6135 3077.0518 3094.5393 3103.4957 3133.5543 3135.0761 3143.3971 3196.7101 3578.9304 3589.5476
redmass: 1.0848 5.0845 6.7443 6.9691 6.1425 8.3225 4.9748 5.8398 5.7670 4.1102 4.8796 8.6970 9.6133 8.9987 7.5026 4.9819 3.8472 5.9666 5.8382 7.1984 6.2050 6.6266 6.2785 2.4482 5.9047 5.3136 2.7395 6.9630 1.5098 1.1246 4.2396 4.1348 9.3152 5.5291 11.7682 2.7971 7.1146 6.3885 6.7875 7.0429 3.2211 5.2825 5.1200 5.2198 6.9550 4.9480 4.4227 3.8545 4.5720 6.0099 5.1003 4.5433 3.8400 7.1765 7.0552 2.8756 2.4651 1.5463 1.5103 3.3307 2.2302 3.0930 1.0641 2.5034 3.5002 1.0894 2.8386 2.3636 3.9504 4.6666 1.6676 3.2052 2.5892 2.9500 3.1810 1.7114 1.3463 1.4493 2.6147 2.8127 2.0173 1.4074 1.8818 1.2277 1.2305 2.5455 2.3377 3.1833 4.1747 2.4030 2.3818 1.2348 1.2686 1.3659 2.4791 2.6555 3.6742 4.5906 1.3999 2.2043 1.1155 1.0946 2.1091 1.7493 4.0831 8.2862 5.4052 3.5773 4.4605 5.0801 9.4341 8.6279 4.3896 1.0699 1.0709 1.0853 1.0802 1.0673 1.0380 1.0584 1.0953 1.0955 1.1061 1.0918 1.0921 1.1013 1.0932 1.0662 1.0663
irintensity: 1.1017 0.4480 0.5818 1.5129 0.3348 2.7508 7.3762 0.3899 3.0578 1.8647 6.4236 4.5297 1.4616 0.4955 0.1060 0.7411 4.4585 5.3497 0.2305 8.2860 2.5499 2.9926 0.7353 5.7062 17.1730 4.7211 38.8515 0.9206 80.9791 158.5498 8.8158 4.2395 15.6486 9.7293 0.1677 7.3600 1.8565 9.2385 10.7978 15.0683 4.2414 3.4010 12.2291 34.5359 7.9082 4.6088 3.3202 10.9753 2.0181 2.0499 0.4868 31.9502 3.8223 15.5941 25.1191 26.0377 13.4827 34.9502 1.2126 21.2918 34.0739 11.6034 23.9722 2.4809 35.2346 213.0791 12.8545 57.5086 65.1449 83.7841 17.6557 61.4454 20.1757 40.0350 94.8894 207.0047 141.9572 67.6497 27.6479 150.8115 57.3705 24.8362 137.9807 65.0809 7.0105 62.0071 132.3426 158.4214 176.6691 461.8664 387.5331 4.6871 34.3962 9.9952 37.8915 17.9834 233.1173 149.1681 36.7583 43.4478 32.1152 16.1343 104.0242 83.6907 21.1340 240.4349 48.1678 177.7748 67.8586 198.0896 156.1178 150.7376 95.8094 390.4035 114.0563 171.2522 12.3856 46.7849 1.9273 49.2472 5.6333 9.0011 10.1824 6.5484 1.4265 6.9472 0.2549 101.0619 86.5773
temp: 298.150 k
press: 1.00000 atm
elementType: 8 8 8 8 8 8 8 8 8 6 6 6 6 6 6 6 6 6 6 6 6 6 6 6 6 6 6 6 6 1 1 1 1 1 1 1 1 1 1 1 1 1 1 1 1
symmnumber: 1
zpe: 850070.2 jmol-1
zpe.correction: 0.323775 hartree
zpe.thermalcorrener: 0.349359 hartree
zpe.thermalcorrenthalpy: 0.350303 hartree
zpe.thermalcorrgfe: 0.266460 hartree
zpe.sumelectzpe: -1446.709862 hartree
zpe.sumelectthermal: -1446.684278 hartree
zpe.sumelectthermalent: -1446.683334 hartree
zpe.sumelectthermalfe: -1446.767177 hartree
dipole: 0.6955 5.3453 0.9492
dipole: 5.4733
quadrupole: -144.5515 -165.8224 -184.6144
quadrupole: -3.8370 -4.3046 1.6025
quadrupole: 20.4447 -0.8263 -19.6183 -3.8370 -4.3046 1.6025
hfenergy: -1447.033637 hartree
pointgroup: C01 [X(C20H16O9)]
dipole: 0.2543326 -0.3315788 -2.11244 debye
polarizability: 429.459332|-27.1786101|171.7310779|12.8611367|43.8106604|245.6349287 unknown
InChI: InChI=1S/C20H16O9/c1-8(22)29-3-2-9(7-21)15-14(25)6-12-17(19(15)27)20(28)16-11(18(12)26)4-10(23)5-13(16)24/h4-7,9,23-25,27H,2-3H2,1H3
charge 0 multiplicity 1
45 atoms
O  1.437305 0.145851 2.063283
O  2.994953 -1.918891 -1.961142
O  3.357028 1.602266 -1.315759
O  -1.021577 0.601287 2.3630
O  -2.104374 -1.475543 -2.650133
O  -3.485311 1.085515 2.736984
O  3.033967 -2.650045 2.207896
O  -6.652042 -0.018945 -0.666234
O  3.192614 3.637686 -0.181554
C  3.641667 -0.8677 0.591372
C  2.226773 -0.884334 0.050403
C  -0.199569 -0.406941 0.339451
C  4.247617 0.553856 0.778405
C  -0.462274 -0.955692 -0.95476
C  1.149895 -0.378258 0.827701
C  1.919515 -1.421132 -1.219457
C  0.594714 -1.457249 -1.728915
C  -2.649287 0.062472 0.67506
C  -1.283393 0.100713 1.161254
C  -2.950388 -0.47321 -0.617371
C  -1.856199 -1.00519 -1.493343
C  4.585866 1.277592 -0.531526
C  3.759302 -1.683843 1.894495
C  -3.724597 0.563957 1.492611
C  -4.273543 -0.508706 -1.082982
C  -5.31896 -0.007707 -0.256542
C  -5.055917 0.525179 1.01892
C  2.737036 2.826316 -1.017546
C  1.474332 2.986369 -1.835244
H  4.281862 -1.412935 -0.136231
H  3.576591 1.178133 1.391989
H  5.198103 0.452543 1.343626
H  0.36391 -1.872748 -2.717131
H  5.121852 2.219745 -0.319604
H  5.173421 0.643774 -1.216529
H  4.616618 -1.370536 2.547234
H  -4.465957 -0.926411 -2.078439
H  -5.868536 0.904897 1.641466
H  0.538081 0.441825 2.490914
H  2.696925 -2.27526 -2.834093
H  -2.467827 1.027629 2.907487
H  -6.750574 -0.41358 -1.568646
H  0.702451 2.285804 -1.467739
H  1.663768 2.742407 -2.893537
H  1.100057 4.015938 -1.742493
