program: Gaussian 09
title: 000005720
version: EM64L-G09RevD.01
frameworkgroup: C1[X(C17H14O3S)]
method: RPBEPBE
basis: SDD
operation: Freq
keyword: #p
keyword: freq=noraman
keyword: PBEPBE/SDD
title: #p freq=noraman PBEPBE/SDD
converged: YES YES NO NO
title: Mulliken charges:
elementType: S O O O C C C C C C C C C C C C C C C C C H H H H H H H H H H H H H H
charge: 0.217099 -0.215846 -0.406640 -0.232654 0.524364 0.539831 -0.345119 -0.729117 -0.363009 -0.558283 -0.466354 0.151566 -0.231624 0.362430 -0.321252 -0.692432 0.179103 -0.342432 -0.250194 -0.238786 -0.223908 0.249985 0.257584 0.258270 0.282004 0.242194 0.256954 0.228949 0.245170 0.225998 0.286453 0.254667 0.238916 0.237455 0.378655
chargesum: 0.00000
title: Mulliken charges with hydrogens summed into heavy atoms:
elementType: S O O O C C C C C C C C C C C C C C C C C
charge: 0.217099 -0.215846 -0.027986 -0.232654 0.524364 0.539831 -0.095134 -0.213263 -0.363009 -0.276279 -0.224160 0.151566 0.025330 0.362430 -0.321252 0.007686 0.179103 -0.055979 0.004473 0.000131 0.013547
polarizability: 2.86569093e+02 -6.67799594e+00 2.05773919e+02 -2.17627391e+01 -1.32647110e+01 1.42901069e+02
1716.lowfreq: -5.6189 -3.2857 0.0005 0.0011 0.0016 7.7938 21.6607 27.9981 40.4300
frequency: 21.6390 27.9653 40.4100 51.9551 83.8378 110.9284 121.2705 128.8478 199.6623 204.9554 214.1978 248.6792 264.1796 269.3191 274.2132 325.5748 350.1895 373.7986 414.3766 421.3147 425.8402 444.5940 474.3295 495.5522 512.3380 526.7111 568.4171 586.7839 605.6702 618.5381 648.6494 650.3433 685.8033 711.4262 730.9014 748.9919 755.6173 768.3994 799.8948 817.2634 841.5312 888.8860 909.4867 922.5652 947.6579 960.4960 977.0595 997.9570 1007.6398 1013.9469 1023.1911 1034.8307 1036.9986 1066.5892 1072.5783 1099.7878 1113.9964 1140.6979 1157.4905 1167.0034 1174.3147 1226.2798 1241.6878 1245.2325 1266.6878 1271.7519 1281.6469 1305.7454 1346.2428 1369.7656 1383.9246 1390.5287 1415.7473 1416.8351 1440.2379 1449.9682 1465.0381 1472.0938 1474.8872 1556.0672 1573.1951 1583.4424 1600.3941 1601.7500 1660.5512 2977.7400 2994.9962 3047.1486 3091.5791 3093.1541 3107.4415 3133.0341 3133.9657 3135.1119 3145.7008 3156.4539 3159.5763 3170.3095 3505.6782
redmass: 6.4184 5.4830 7.8774 10.5235 5.0476 5.3089 5.6647 3.8787 2.8063 4.8921 1.2331 5.9879 4.3181 4.8353 6.2348 5.4418 5.7865 6.2189 4.2284 3.5055 7.0771 3.0681 3.8688 4.5830 5.1616 3.8002 3.2569 5.0047 3.3269 3.1514 3.9498 2.1646 5.2338 4.1996 4.7833 3.4446 4.4634 1.5893 2.6534 2.7628 1.5184 1.4034 2.2691 1.9691 1.8862 1.4146 1.3922 3.0431 1.3666 3.7952 4.5559 5.8947 2.3473 1.9109 1.7000 2.3056 1.7993 1.5706 1.3505 1.5925 1.0618 1.9925 1.6371 1.7190 1.3235 2.0057 1.5012 1.8451 2.0163 10.3472 4.8522 1.1986 2.1982 2.4256 1.1474 2.3308 1.6276 1.2989 1.0901 6.9969 7.8906 7.1470 6.1070 6.8365 8.2018 1.0645 1.0351 1.0851 1.0967 1.1004 1.1005 1.0889 1.0857 1.0917 1.0895 1.0945 1.0965 1.1009 1.0639
irintensity: 0.5755 0.8692 3.2439 1.1782 0.2704 1.5830 0.3315 0.1031 2.1681 0.1099 1.4336 0.5257 3.9191 1.6035 1.5208 3.0156 1.0523 5.6333 0.5680 6.2244 2.6665 4.7121 22.3679 3.5339 3.8489 6.6021 34.7281 20.4032 36.3784 17.2295 15.7164 68.4233 16.0336 15.3313 4.8476 28.3794 16.2739 42.6412 22.3965 0.3501 25.5539 0.5314 5.4027 5.7688 4.0627 0.9269 1.3315 6.2130 0.2668 14.4501 55.8781 21.8955 216.7135 23.8611 25.0582 49.5816 9.0856 9.6819 21.3420 2.9927 1.2470 0.2543 2.8293 29.1670 5.9635 120.2174 9.4420 7.1462 41.8315 6.7908 1.8357 18.8264 38.0149 12.2806 32.7725 28.6795 12.4445 37.9529 15.0099 38.1200 124.3435 16.1163 16.7131 42.8937 178.1815 8.3745 27.6469 6.7092 6.1361 35.9778 16.5305 8.1618 2.0003 1.3387 5.3675 4.4741 8.9069 31.9728 24.3868
temp: 298.150 k
press: 1.00000 atm
elementType: 16 8 8 8 6 6 6 6 6 6 6 6 6 6 6 6 6 6 6 6 6 1 1 1 1 1 1 1 1 1 1 1 1 1 1
symmnumber: 1
zpe: 694849.0 jmol-1
zpe.correction: 0.264654 hartree
zpe.thermalcorrener: 0.283049 hartree
zpe.thermalcorrenthalpy: 0.283994 hartree
zpe.thermalcorrgfe: 0.216361 hartree
zpe.sumelectzpe: -1278.480560 hartree
zpe.sumelectthermal: -1278.462165 hartree
zpe.sumelectthermalent: -1278.461221 hartree
zpe.sumelectthermalfe: -1278.528853 hartree
dipole: -0.3272 -2.9520 1.9728
dipole: 3.5656
quadrupole: -108.1494 -133.4708 -125.9284
quadrupole: -4.5920 -2.1202 4.5045
quadrupole: 14.3668 -10.9546 -3.4122 -4.5920 -2.1202 4.5045
hfenergy: -1278.745214 hartree
pointgroup: C01[X(C17H14O3S1)]
dipole: 0.0374045 -1.1491189 -0.8037321 debye
polarizability: 284.4319646|4.4418512|204.7209281|-28.3911589|15.2869938|146.0911891 unknown
InChI: InChI=1S/C17H14O3S/c1-10(17(19)20)11-6-7-15-12(8-11)9-14(18)13-4-2-3-5-16(13)21-15/h2-8,10,19H,9H2,1H3
charge 0 multiplicity 1
35 atoms
S  1.792905 -2.129601 0.353845
O  1.374332 2.525973 0.988711
O  -4.400459 1.33512 -1.869539
O  -4.106237 2.194961 0.266767
C  -0.363406 -0.386151 0.916706
C  -2.630387 -0.685513 -0.00411
C  -4.106262 -0.264987 -0.078889
C  0.635242 0.362903 1.781034
C  0.062715 -1.520914 0.183562
C  -1.709857 0.030119 0.801675
C  -2.183293 -1.826555 -0.713581
C  1.5296 1.270817 0.927337
C  -0.83746 -2.245384 -0.62449
C  2.607283 0.679452 0.054754
C  2.827982 -0.706224 -0.215587
C  -4.835043 -0.487138 1.271805
C  -4.201599 1.203543 -0.488984
C  3.523758 1.621845 -0.503381
C  3.955797 -1.10906 -0.976442
C  4.636271 1.221034 -1.259067
C  4.861827 -0.158556 -1.485879
H  -4.596305 -0.857341 -0.870354
H  0.121492 1.013089 2.506746
H  1.267139 -0.370584 2.321722
H  -2.039246 0.924225 1.344131
H  -2.882099 -2.38283 -1.348822
H  -0.487858 -3.115849 -1.188276
H  -4.741578 -1.542191 1.581232
H  -4.398831 0.151614 2.057903
H  -5.907906 -0.238572 1.186361
H  3.325448 2.679061 -0.298834
H  4.103943 -2.173405 -1.18716
H  5.324049 1.968869 -1.666903
H  5.724471 -0.492886 -2.072426
H  -4.408528 2.302015 -2.110266
