program: Gaussian 09
title: 000005740
version: EM64L-G09RevD.01
frameworkgroup: C1[X(C22H22N4O3S)]
method: RPBEPBE
basis: SDD
operation: Freq
keyword: #p
keyword: freq=noraman
keyword: PBEPBE/SDD
title: #p freq=noraman PBEPBE/SDD
converged: YES YES NO NO
title: Mulliken charges:
elementType: S O O O N N N N C C C C C C C C C C C C C C C C C C C C C C H H H H H H H H H H H H H H H H H H H H H H
charge: 0.314226 -0.224301 -0.228486 -0.452101 -0.474847 -0.049123 -0.103154 -0.029233 0.295437 0.062026 0.118507 -0.477581 0.158687 0.220291 0.454764 -0.501965 0.407239 -0.470255 -0.486255 0.270519 -0.427700 -0.203905 -0.407380 -0.248373 -0.240475 -0.717182 -0.186514 -0.681346 -0.684080 -0.371340 0.212265 0.282920 0.308700 0.311419 0.214500 0.274923 0.223581 0.241272 0.208610 0.208357 0.215540 0.215631 0.275900 0.207142 0.236236 0.236313 0.208933 0.233682 0.233565 0.233436 0.221025 0.359953
chargesum: 0.00000
title: Mulliken charges with hydrogens summed into heavy atoms:
elementType: S O O O N N N N C C C C C C C C C C C C C C C C C C C C C C
charge: 0.314226 -0.224301 -0.228486 -0.092147 -0.166147 -0.049123 -0.103154 -0.029233 0.295437 0.062026 0.118507 -0.265316 0.158687 0.220291 0.454764 -0.219045 0.407239 -0.158837 -0.271756 0.270519 -0.152777 0.019675 -0.166108 0.168594 0.190697 -0.441282 -0.186514 -0.001656 -0.007900 0.083121
polarizability: 5.62907165e+02 4.62356897e-01 3.46957856e+02 -3.00864120e+00 5.40932322e-01 1.35176293e+02
1716.lowfreq: -3.0532 -2.1582 -0.0019 -0.0017 -0.0008 6.4289 13.8283 17.4714 25.8944
frequency: 13.4226 17.3740 25.8732 32.6099 42.4492 58.6729 63.4495 72.2761 90.3144 93.3167 96.4932 112.5231 126.9316 130.2360 143.3263 152.3534 180.7309 187.2205 207.5965 238.3661 240.3188 242.5544 245.6064 259.5734 263.1393 276.9729 278.5837 304.7660 317.7336 330.7345 363.7445 389.1104 395.0929 440.6210 449.9785 468.2713 492.4907 499.5219 523.7669 546.5093 567.3430 570.5015 576.3345 591.1979 592.2619 616.5386 652.6582 654.6272 676.8438 682.2158 691.5336 708.4279 728.5232 751.1563 776.1614 780.1466 785.1598 811.6745 811.9724 821.9778 832.3609 842.7849 846.4509 873.0108 886.2099 887.3471 904.6965 911.0386 930.4007 934.7791 949.5199 979.3207 983.7116 984.6325 992.4617 1022.8894 1032.9252 1041.7671 1051.1007 1093.8571 1105.5054 1114.6617 1117.3749 1122.3850 1135.4096 1135.9096 1172.4639 1176.4025 1181.0401 1190.6911 1211.6791 1237.2151 1240.8732 1265.6309 1265.9704 1266.8635 1280.5738 1283.4458 1302.8328 1315.8221 1344.6475 1365.6372 1373.0132 1380.1798 1385.5146 1400.9634 1402.3992 1405.7652 1418.5440 1422.9920 1446.1993 1461.0037 1461.3023 1461.5433 1466.8039 1476.0806 1476.8874 1486.5230 1487.5680 1496.2907 1513.4402 1521.6514 1546.4621 1549.8085 1565.2404 1598.6777 1615.5317 1623.3952 2943.7193 2948.7028 2963.7747 2998.9446 3000.1533 3007.5928 3008.1681 3024.2893 3096.0989 3097.3988 3104.1106 3108.9043 3110.8219 3143.0446 3144.3902 3148.0091 3175.6647 3182.2064 3183.6980 3240.6930 3561.2009 3592.1115
redmass: 6.3440 4.8656 5.2634 6.5517 4.1014 4.3489 4.2759 5.2742 5.2379 3.0884 3.6220 1.6289 1.8949 4.9977 6.1175 4.5886 5.0742 5.9424 1.6589 2.0650 1.2181 1.8528 1.8052 4.5366 4.5127 6.5133 4.8306 5.1778 6.3622 3.6482 6.6140 5.8576 6.3425 2.8570 3.1003 5.6062 5.8922 5.5427 6.2140 2.2568 4.9710 3.2401 7.3647 5.1716 2.6618 10.1679 6.0887 6.3036 7.6027 6.8709 2.8841 2.0628 2.4242 6.0553 2.4437 1.5554 6.3127 2.0725 3.4197 1.3353 1.3042 1.4382 6.3216 3.3029 7.3480 1.8913 1.4168 4.2312 4.4726 1.4449 1.4521 2.0552 5.8613 1.3491 4.3694 2.7818 2.5884 3.1091 1.9906 1.7868 2.0744 2.2910 2.2360 3.8389 1.4373 1.4408 3.6924 1.0912 1.0893 1.7489 2.2555 1.3654 3.0853 1.1389 4.5139 1.1411 1.6158 2.3078 2.2756 2.7350 2.6295 1.3114 1.4837 3.2027 1.6507 1.5024 1.3861 2.2633 2.1288 4.2237 3.8795 1.0392 1.0873 1.0397 3.1488 1.1706 1.0685 1.1852 1.0881 3.7087 3.2784 5.6846 8.5045 9.3398 2.7732 4.5601 6.5800 4.5557 1.0592 1.0551 1.0555 1.0364 1.0365 1.1075 1.1010 1.1076 1.0988 1.0988 1.0889 1.1015 1.1014 1.0892 1.0921 1.0916 1.0955 1.0931 1.0913 1.0953 1.0743 1.0669
irintensity: 0.3811 0.5714 0.1910 0.2579 4.8185 0.9625 0.3816 0.2717 10.9129 0.0683 4.1853 5.5884 0.0891 6.2678 0.1405 0.5052 21.0316 4.9196 98.9589 49.9030 0.5296 1.7898 0.1416 2.9003 1.7606 0.0280 1.9217 3.3523 0.6354 0.1800 1.7450 2.9897 5.5520 2.6351 2.1502 1.4153 9.9042 5.0686 2.4484 24.9527 21.5288 5.3417 34.0506 3.0180 3.6573 15.0103 13.3165 5.4504 14.9292 0.6488 10.0843 6.7247 1.5545 0.4910 0.0568 129.9515 11.0921 5.9855 12.3229 46.7596 0.8818 4.2060 1.2727 9.3356 19.5623 12.7281 0.0307 62.8458 52.1458 16.7338 24.7040 6.4984 5.9249 1.4474 97.4220 30.0108 50.4449 27.0730 44.4586 58.7039 62.7255 38.1501 1.7957 92.6484 2.0499 8.0163 111.4037 8.7416 1.0080 32.6930 156.1239 26.8209 137.8337 0.1120 210.6595 0.2675 4.6795 7.7112 59.4997 77.9489 11.4637 8.7155 58.8901 51.9891 1.7478 108.8598 20.3843 23.8392 2.5857 46.6917 305.1189 5.1017 15.3728 19.6012 467.6877 39.2781 13.5204 84.7059 1.8572 232.3387 202.0211 31.5767 104.7933 161.8050 253.1803 163.2990 183.2222 45.2219 40.6120 24.9008 28.8477 28.0322 26.2408 35.2930 28.5603 29.0213 30.5953 17.3531 18.1221 30.0840 31.6183 13.3395 26.8357 20.5724 5.4399 27.1964 7.6802 2.7366 11.0662 5.8206
temp: 298.150 k
press: 1.00000 atm
elementType: 16 8 8 8 7 7 7 7 6 6 6 6 6 6 6 6 6 6 6 6 6 6 6 6 6 6 6 6 6 6 1 1 1 1 1 1 1 1 1 1 1 1 1 1 1 1 1 1 1 1 1 1
symmnumber: 1
zpe: 1054530.1 jmol-1
zpe.correction: 0.401649 hartree
zpe.thermalcorrener: 0.430146 hartree
zpe.thermalcorrenthalpy: 0.431090 hartree
zpe.thermalcorrgfe: 0.339206 hartree
zpe.sumelectzpe: -1692.107270 hartree
zpe.sumelectthermal: -1692.078773 hartree
zpe.sumelectthermalent: -1692.077829 hartree
zpe.sumelectthermalfe: -1692.169713 hartree
dipole: 1.9609 3.8537 1.0941
dipole: 4.4602
quadrupole: -124.3197 -167.4054 -189.1571
quadrupole: -3.0719 -10.6948 -1.3841
quadrupole: 35.9744 -7.1114 -28.8630 -3.0719 -10.6948 -1.3841
hfenergy: -1692.5089191 hartree
pointgroup: C01 [X(C22H22N4O3S1)]
dipole: -0.6349613 1.5342284 -0.5676343 debye
polarizability: 560.4592144|-13.9563833|347.1061439|24.8669504|-14.3673445|137.4759559 unknown
InChI: InChI=1S/C22H22N4O3S/c1-3-28-19-9-16-17(10-20(19)29-4-2)23-13-24-22(16)25-15-7-5-6-14(8-15)18-12-30-21(11-27)26-18/h5-10,12-13,25,27H,3-4,11H2,1-2H3
charge 0 multiplicity 1
52 atoms
S  6.38964 -2.442574 0.20428
O  -5.184482 1.738326 -0.77111
O  -6.264241 -0.657897 -0.701481
O  9.21544 -1.816283 0.672716
N  0.064028 0.941227 -0.35725
N  -1.882267 -2.797233 -0.280179
N  0.141063 -1.43166 -0.221081
N  6.276636 0.212153 -0.02068
C  -2.039002 -0.322081 -0.431916
C  -2.639141 -1.62976 -0.397673
C  -0.584627 -0.286519 -0.333941
C  -2.887819 0.822952 -0.557983
C  -4.278845 0.686184 -0.645859
C  -4.877727 -0.633563 -0.608551
C  1.445364 1.277044 -0.294585
C  -4.057113 -1.758181 -0.486999
C  3.83798 0.749169 -0.137603
C  2.485718 0.323413 -0.189839
C  1.762923 2.664923 -0.346739
C  4.935012 -0.237808 -0.02703
C  4.148245 2.133876 -0.192106
C  3.107002 3.080051 -0.295603
C  -0.552678 -2.620498 -0.201242
C  -4.643024 3.112062 -0.818692
C  -6.924631 -1.983598 -0.664739
C  4.805896 -1.619475 0.084925
C  7.143294 -0.772653 0.085086
C  -5.837635 4.04966 -0.964469
C  -8.424051 -1.729083 -0.7778
C  8.636651 -0.620527 0.050505
H  -2.4679 1.832755 -0.590879
H  -4.457872 -2.773701 -0.455614
H  -0.547947 1.753587 -0.435435
H  2.204824 -0.72982 -0.154387
H  0.960173 3.410219 -0.427885
H  5.196136 2.442709 -0.151606
H  3.343707 4.148836 -0.336575
H  0.0633 -3.521021 -0.10949
H  -4.080004 3.316261 0.116075
H  -3.950249 3.203595 -1.681379
H  -6.549799 -2.59892 -1.507617
H  -6.666784 -2.490636 0.287123
H  3.893722 -2.21049 0.126947
H  -5.493008 5.098896 -1.005855
H  -6.395989 3.826279 -1.889058
H  -6.525334 3.939014 -0.109285
H  -8.971502 -2.688785 -0.753374
H  -8.777051 -1.102116 0.058307
H  -8.662027 -1.213187 -1.723314
H  8.907831 0.305567 0.596135
H  8.968933 -0.516626 -1.005471
H  10.178328 -1.874164 0.455678
