program: Gaussian 09
title: 000040071
version: EM64L-G09RevD.01
frameworkgroup: C1[X(C6H8Br2O4)]
method: RPBEPBE
basis: SDD
operation: Freq
keyword: #p
keyword: freq=noraman
keyword: PBEPBE/SDD
title: #p freq=noraman PBEPBE/SDD
converged: NO YES NO NO
title: Mulliken charges:
elementType: Br Br O O O O C C C C C C H H H H H H H H
charge: 0.013227 0.031195 -0.417667 -0.403700 -0.211085 -0.225361 -0.419137 -0.462594 -0.445051 -0.464581 0.191295 0.215649 0.342396 0.347446 0.288664 0.266586 0.312017 0.262105 0.393111 0.385485
chargesum: 0.00000
title: Mulliken charges with hydrogens summed into heavy atoms:
elementType: Br Br O O O O C C C C C C
charge: 0.013227 0.031195 -0.024556 -0.018215 -0.211085 -0.225361 -0.076741 -0.115148 0.110199 0.109542 0.191295 0.215649
polarizability: 1.01086897e+02 3.74926457e+00 1.22167583e+02 -7.26112618e+00 3.65706189e+00 1.00023171e+02
1716.lowfreq: -8.2116 -0.0003 -0.0003 0.0008 0.8682 8.2704 27.2600 35.1440 42.2554
frequency: 27.1998 35.1388 42.2139 46.4028 76.9533 92.0363 107.1175 162.2361 176.5182 212.2739 283.3115 291.4170 419.3490 425.6190 482.5077 493.7624 524.2050 549.8183 591.3097 611.4452 651.7578 660.4103 688.6178 822.1003 857.1544 896.9505 945.4954 971.8221 1046.2054 1068.5306 1071.1350 1128.7939 1159.6790 1173.5191 1203.7245 1231.3793 1247.7959 1287.8961 1294.5145 1305.7887 1337.0289 1375.8084 1424.2501 1444.8646 1665.8242 1670.5195 2986.6630 3018.3285 3050.7254 3088.3416 3099.6523 3115.9210 3512.3646 3517.9335
redmass: 11.6661 10.6944 6.9755 12.6262 6.7374 9.3470 15.8628 7.9887 4.2243 10.4338 3.7799 3.7172 4.7526 3.5204 5.1817 2.1055 2.8829 2.7934 3.5922 2.4553 1.4778 1.8071 3.7563 5.3849 3.1450 2.6901 2.3635 2.8261 2.9089 2.0171 2.2011 2.2206 1.1575 1.2823 1.1977 1.2057 1.2987 2.0425 2.0044 1.4773 1.2709 1.9448 1.0795 1.0759 8.7208 9.1502 1.0679 1.0644 1.0842 1.0955 1.0911 1.0883 1.0640 1.0642
irintensity: 0.7282 1.7195 0.5514 1.2983 0.4402 1.8208 0.2067 1.0629 1.4975 0.9521 1.9403 2.0133 16.8004 15.8499 26.8948 15.9411 54.3187 50.1142 16.3158 96.4742 74.6626 101.5715 53.5395 18.3129 6.3591 5.3389 41.5260 39.7279 41.4169 353.2124 51.6414 5.8150 19.6741 24.0436 14.9937 15.2737 13.3564 18.0970 46.7343 31.6602 9.7969 62.6442 15.0261 32.3258 166.7309 311.3978 5.9695 4.5667 9.0179 3.3202 0.7092 0.7944 33.3553 39.4011
temp: 298.150 k
press: 1.00000 atm
elementType: 35 35 8 8 8 8 6 6 6 6 6 6 1 1 1 1 1 1 1 1
symmnumber: 1
zpe: 362901.1 jmol-1
zpe.correction: 0.138222 hartree
zpe.thermalcorrener: 0.152061 hartree
zpe.thermalcorrenthalpy: 0.153005 hartree
zpe.thermalcorrgfe: 0.093012 hartree
zpe.sumelectzpe: -560.336556 hartree
zpe.sumelectthermal: -560.322717 hartree
zpe.sumelectthermalent: -560.321773 hartree
zpe.sumelectthermalfe: -560.381766 hartree
dipole: 0.5767 0.9461 -0.4948
dipole: 1.2135
quadrupole: -83.3684 -98.5893 -85.6490
quadrupole: -2.3906 9.4070 3.0112
quadrupole: 5.8339 -9.3871 3.5532 -2.3906 9.4070 3.0112
hfenergy: -560.474778 hartree
pointgroup: C01 [X(C6H8Br2O4)]
dipole: 0.2056998 -0.3470896 0.2552223 debye
dipolederiv: -0.1832735 0.06972 0.0159204 0.0275954 -0.5263013 -0.1713201 -0.0055341 -0.2239312 -0.2074816 -0.244835 0.0663201 -0.1438865 0.0739856 -0.1653472 0.2086929 -0.1370088 0.1776843 -0.3888282 -0.4935564 0.0145853 0.1388771 0.0094941 -0.3132317 0.0229822 0.1319098 0.0812831 -1.1348836 -1.1346612 -0.0030577 0.4368729 -0.0067765 -0.3059236 0.0964123 0.3626656 0.0659555 -0.5442529 -0.4002473 0.2000629 -0.052162 0.2692724 -0.9494163 0.3169438 0.0275304 0.0849392 -0.6340413 -0.6418981 -0.1683992 0.0947891 0.0582835 -0.694581 -0.2965002 0.2259183 -0.2125797 -0.5685372 0.1964302 -0.1590241 -0.0042478 0.0226095 0.7518209 0.5117129 0.0391196 0.3661233 0.1706476 0.2936761 0.0028611 0.2866547 -0.2040658 0.0196387 -0.5019168 0.1285144 -0.4118859 0.5322737 -0.0266894 0.0672613 -0.0908419 0.1009726 -0.3160324 -0.1633338 0.0203166 -0.2275658 -0.1007551 -0.2253241 -0.1113321 -0.0711457 -0.1718031 -0.1144787 -0.0145515 -0.0648558 -0.0942992 -0.1430645 0.4019007 -0.2990093 -0.1059106 -0.4610421 1.2472257 -0.26654 -0.2184953 -0.0638634 1.4163896 1.4527461 0.3186369 -0.4952178 0.1465847 0.8537021 0.3565725 -0.4697596 0.3819277 0.7355572 0.0311963 -0.0096106 0.0256341 -0.020323 -0.0136686 -0.064952 0.0225349 -0.0159349 0.0031328 0.0789459 -0.0048369 -0.069001 0.1010124 0.0127886 0.0111112 -0.005496 0.0511563 0.0009181 -0.0303343 -0.0091471 -0.0461642 -0.0267617 0.0697072 -0.0073181 -0.0318391 0.0055702 0.0942808 0.0652641 0.0127719 0.1051817 0.0032468 0.0482362 0.0403753 0.0667828 0.0554646 0.0213493 0.0680465 0.0198831 0.0253233 0.0405232 0.0267873 -0.0322293 0.0307602 -0.0069674 0.1292198 0.086287 -0.0101777 -0.0304104 0.0216484 0.0542983 0.0862428 -0.0569291 0.0771474 -0.0324974 0.3779346 0.0573145 -0.0025307 0.101226 0.1288696 -0.0250717 -0.0218541 0.0352192 0.3393821 0.3283919 -0.0548225 -0.0177347 -0.0856823 0.1859062 -0.1073125 -0.0442807 -0.1254432 0.3111908 unknown
polarizability: 98.4946113|-8.0448672|120.3647038|5.7840956|3.1649136|104.4183355 unknown
InChI: InChI=1S/C6H8Br2O4/c7-3(1-5(9)10)4(8)2-6(11)12/h3-4,9,11H,1-2H2
charge 0 multiplicity 1
20 atoms
Br 0.678252 2.938733 1.036718
Br -1.092104 1.687302 -1.988365
O  2.562006 -0.802673 -1.172731
O  -3.498628 -0.690368 0.817646
O  2.65392 -2.037653 0.795019
O  -2.048773 -1.70865 -0.685642
C  1.043337 1.22766 -0.021489
C  -0.258602 0.57086 -0.497474
C  1.90795 0.31411 0.875575
C  -1.319482 0.292818 0.572897
C  2.39267 -0.969256 0.207981
C  -2.284599 -0.798424 0.13741
H  1.621358 1.579056 -0.88799
H  0.000432 -0.360064 -1.033175
H  2.80877 0.879754 1.180672
H  1.390608 0.031876 1.807224
H  -1.873496 1.202806 0.848936
H  -0.826522 -0.066932 1.500222
H  2.904672 -1.645312 -1.577729
H  -4.103068 -1.432145 0.540593
