program: Gaussian 09
title: 000040066
version: EM64L-G09RevD.01
frameworkgroup: C1[X(C10H8O2)]
method: RPBEPBE
basis: SDD
operation: Freq
keyword: #pfreq=noraman
keyword: PBEPBE/SDD
title: #p freq=noraman PBEPBE/SDD
converged: YES YES YES YES
title: Mulliken charges:
elementType: O O C C C C C C C C C C H H H H H H H H
charge: -0.258328 -0.218474 0.353019 0.172830 -0.424524 0.331877 -0.434987 -0.373868 -0.352658 -0.257157 -0.200436 -0.221622 0.264388 0.231699 0.251543 0.237297 0.258810 0.234352 0.235240 0.171000
chargesum: 0.00000
title: Mulliken charges with hydrogens summed into heavy atoms:
elementType: O O C C C C C C C C C C
charge: -0.258328 -0.218474 0.353019 0.172830 0.071564 0.331877 -0.183444 -0.136571 -0.093848 -0.022805 0.034804 -0.050622
polarizability: 2.15006394e+02 -3.79350128e+00 1.09982248e+02 -2.44640011e-01 4.23320708e-01 4.85053509e+01
1716.lowfreq: -12.7152 -0.0009 -0.0008 0.0006 6.7685 11.0262 66.7476 105.2392 158.4428
frequency: 66.7375 105.2252 158.4418 175.9317 241.4994 331.7078 332.2295 385.1855 425.0676 456.9537 506.7001 555.3409 570.0944 601.6974 694.9243 738.5771 744.9945 762.3385 854.6262 861.5664 881.2889 899.1648 949.9167 964.7759 971.4128 984.0292 1015.6009 1027.5009 1103.0718 1165.8115 1171.8366 1197.8752 1206.4474 1259.1119 1286.6662 1331.6657 1358.2488 1389.7795 1397.4247 1445.5390 1464.6128 1474.3987 1563.8249 1575.3947 1617.2938 1633.4286 2874.6765 2969.2456 3098.9954 3114.2405 3127.8284 3141.9119 3164.5138 3176.7409
redmass: 6.0894 2.8255 5.3580 4.7291 4.5613 5.1398 3.3467 4.4705 3.0215 3.2043 5.1255 3.3720 5.9189 6.8495 5.7249 4.7103 3.6799 1.2487 3.9934 1.4572 3.0760 1.7138 1.4175 8.0113 1.6205 1.3425 1.8649 2.1033 1.9877 1.1739 1.4646 1.1983 1.8538 2.1638 1.9465 1.6289 1.5374 2.0442 4.9726 2.4379 1.8870 1.3413 6.0437 6.9719 6.9248 6.8112 1.0854 1.0692 1.0946 1.0919 1.0884 1.0890 1.0946 1.0992
irintensity: 1.6169 1.3722 7.5017 15.1959 3.1066 3.9606 2.5687 4.4209 3.2478 6.1258 8.9877 2.5683 6.3935 20.1880 17.4045 6.1993 0.9478 89.5692 1.8516 9.8397 9.3068 6.0938 2.7631 11.5748 17.4725 0.2310 5.0902 4.0778 30.2975 17.0433 72.9932 2.8314 88.4992 7.8592 15.7012 27.3695 5.3562 76.9512 6.1653 27.6385 7.0821 18.4021 97.8611 345.6105 7.9161 191.0678 122.3109 47.7164 4.5585 9.4760 5.3256 7.9962 18.3588 15.9461
temp: 298.150 k
press: 1.00000 atm
elementType: 8 8 6 6 6 6 6 6 6 6 6 6 1 1 1 1 1 1 1 1
symmnumber: 1
zpe: 398201.6 jmol-1
zpe.correction: 0.151667 hartree
zpe.thermalcorrener: 0.161182 hartree
zpe.thermalcorrenthalpy: 0.162126 hartree
zpe.thermalcorrgfe: 0.116515 hartree
zpe.sumelectzpe: -535.445496 hartree
zpe.sumelectthermal: -535.435981 hartree
zpe.sumelectthermalent: -535.435037 hartree
zpe.sumelectthermalfe: -535.480647 hartree
dipole: 3.9949 -2.0379 0.5509
dipole: 4.5184
quadrupole: -79.3201 -62.1578 -71.9798
quadrupole: 2.5072 -0.5797 1.2343
quadrupole: -8.1676 8.9948 -0.8272 2.5072 -0.5797 1.2343
hfenergy: -535.5971625 hartree
pointgroup: C01 [X(C10H8O2)]
dipole: -1.5603304 0.8120228 0.2572447 debye
dipolederiv: -0.7493283 0.4414259 -0.0567089 0.2834553 -0.5495912 0.0312862 0.0446548 -0.0599876 -0.292056 -1.406454 0.046123 0.0362296 0.50483 -0.4640193 -0.0002599 -0.011533 0.0159254 -0.347105 -0.7605517 -0.158306 -0.0141654 -0.0800239 -0.2499448 0.0022311 0.0266424 -0.0332207 -0.025258 0.5645544 -0.502152 -0.0593686 -0.1219084 0.4607606 -0.0306952 -0.1053243 0.058637 0.0933701 0.4600744 -0.1524515 0.1264315 -0.0204367 0.1588496 -0.0137823 0.0918332 -0.0554384 0.4294112 -1.5020444 -0.061063 -0.0033459 -0.0816496 -0.0524494 -0.0164509 0.1167471 0.0010205 -0.0629956 1.1350382 0.151301 -0.0159738 -0.0409046 0.1208036 -0.0154845 -0.0578277 -0.0216969 -0.116567 0.5030233 0.1543332 0.0138666 -0.1883384 0.1160934 0.0230981 0.0331925 0.0221914 -0.1349695 -0.2837432 0.2883283 0.0311687 0.0535919 0.050735 0.0319959 0.0283199 0.047333 -0.1708076 -0.2666397 -0.1917687 -0.026087 -0.4230425 -0.1964327 0.0050112 -0.0367451 0.0136365 -0.184836 0.0417637 -0.0542978 -0.0129125 0.2111308 0.2397878 0.0366318 0.0163723 0.0275075 -0.1239599 2.081258 -0.0187128 -0.0756273 0.0946145 0.6598572 -0.0687957 -0.0823596 -0.0584265 0.1056491 0.0033204 0.0780364 0.0251948 0.0181199 0.0565982 -0.0343204 0.0341103 -0.0560182 0.0606524 0.0584636 -0.0042863 0.0109788 0.0033832 0.0447853 0.0352797 -0.0890233 0.1041348 -0.1383262 0.0601989 -0.0210914 0.0107553 -0.0628452 -0.0696492 0.0269155 -0.0136177 0.0271424 0.1521509 0.0844874 -0.0623278 -0.0015511 -0.0056181 -0.0875193 -0.0184586 -0.0119314 -0.018286 0.1529669 0.0888898 -0.0008027 0.0013761 -0.0396576 -0.0487285 -0.0200751 -0.0055208 -0.0159613 0.1713576 -0.0579858 0.0931315 0.013015 0.1062428 0.0142254 -0.0167272 0.013738 -0.0191648 0.1702604 -0.0951768 -0.0690989 -0.0033629 -0.0689324 0.0695338 -0.0064883 -0.0070935 -0.0102386 0.1552159 0.0408522 0.0436796 0.000087 -0.1420111 -0.2736958 0.0490885 0.0153659 0.0309104 0.1058463 unknown
polarizability: 214.8924027|-4.8073342|110.054407|-2.2376792|1.0225562|48.5471832 unknown
InChI: InChI=1S/C10H8O2/c11-6-8-5-9-3-1-2-4-10(9)12-7-8/h1-6H,7H2
charge 0 multiplicity 1
20 atoms
O  0.210356 -1.656361 -0.224659
O  4.209629 -0.043976 -0.135479
C  -0.611844 0.660716 0.030685
C  -0.842339 -0.749892 -0.076161
C  1.556184 -1.21695 0.243385
C  1.816284 0.255489 -0.010365
C  0.759001 1.136161 -0.056161
C  -1.734219 1.529394 0.12063
C  -2.154606 -1.265913 -0.122921
C  -3.0451 1.01805 0.105682
C  -3.249338 -0.380738 -0.023846
C  3.198498 0.719518 -0.158229
H  2.276808 -1.849613 -0.296869
H  1.629197 -1.448305 1.326053
H  0.942233 2.210057 -0.195842
H  -1.562483 2.609809 0.198664
H  -2.297317 -2.345145 -0.229557
H  -3.902792 1.693233 0.183606
H  -4.267873 -0.783421 -0.045706
H  3.312419 1.825488 -0.291012
