program: Gaussian 09
title: 000040178
version: EM64L-G09RevD.01
frameworkgroup: C1[X(C22H24N2O2)]
method: RPBEPBE
basis: SDD
operation: Freq
keyword: #p
keyword: freq=noraman
keyword: PBEPBE/SDD
title: #p freq=noraman PBEPBE/SDD
converged: NO YES NO NO
title: Mulliken charges:
elementType: O O N N C C C C C C C C C C C C C C C C C C C C C C H H H H H H H H H H H H H H H H H H H H H H H H
charge: -0.257566 -0.250333 -0.337577 -0.488755 -0.032168 -0.422666 -0.456168 -0.409659 -0.411765 -0.376200 0.091798 0.349197 -0.501049 0.419033 0.158184 0.256171 -0.350561 -0.397776 -0.249985 -0.246845 -0.347177 -0.367969 -0.246422 -0.224408 -0.231498 -0.225645 0.239679 0.255814 0.186823 0.199324 0.217537 0.241796 0.195573 0.204874 0.184171 0.198283 0.187698 0.318213 0.223872 0.314003 0.270272 0.227711 0.229554 0.226406 0.270665 0.236171 0.229708 0.233567 0.232127 0.233968
chargesum: 0.00000
title: Mulliken charges with hydrogens summed into heavy atoms:
elementType: O O N N C C C C C C C C C C C C C C C C C C C C C C
charge: -0.257566 -0.250333 -0.019364 -0.174751 0.207511 0.019971 -0.039307 0.027710 -0.022721 0.009781 0.091798 0.349197 -0.277178 0.419033 0.158184 0.256171 -0.080288 -0.170066 -0.020431 -0.020439 -0.076512 -0.131798 -0.016714 0.009159 0.000630 0.008323
polarizability: 4.04941646e+02 3.98469430e+01 2.53265812e+02 2.41462572e+00 2.77553911e+00 1.82587998e+02
1716.lowfreq: -9.0001 -6.6283 -1.1628 -0.0004 0.0001 0.0005 18.8493 20.6689 29.5058
frequency: 18.4162 20.3281 29.3315 34.9734 40.1800 47.5631 67.6097 76.9577 86.9979 104.5775 122.4745 138.9385 166.9792 183.9085 206.8220 215.1658 255.3128 260.7088 290.1628 302.2227 330.9261 368.0949 382.6115 402.2257 405.9914 407.1884 448.5159 457.1894 468.6681 503.0970 507.7646 543.6205 565.0842 590.5069 612.4480 614.7687 621.7603 630.9723 655.5109 668.5254 690.6215 700.1828 704.5832 754.0840 761.2496 774.0159 787.4317 792.2068 828.0597 832.0698 846.4828 854.0122 857.7537 860.7787 868.0722 892.8641 899.4104 926.2750 927.7585 938.0675 976.0970 978.2381 984.7018 987.1818 989.9845 996.3686 1005.4650 1010.4909 1023.7198 1029.2817 1043.1231 1054.0807 1073.1397 1086.3422 1089.3948 1094.2810 1112.5961 1147.9931 1158.4846 1172.8763 1174.4382 1189.1101 1192.8449 1198.6791 1221.4609 1243.3014 1251.4879 1256.8853 1258.1729 1272.3847 1296.5942 1317.5859 1320.8065 1329.3019 1333.3168 1334.6176 1346.4393 1354.4115 1358.2125 1368.2613 1382.7064 1385.2243 1432.2700 1437.2998 1453.9801 1460.3671 1461.9417 1470.3137 1471.6156 1477.0253 1481.9241 1489.6033 1494.1505 1574.5426 1578.0473 1592.8706 1604.5531 1609.4562 1610.8344 1623.3730 2953.1549 2961.0949 2974.7949 2978.4521 2988.1971 3010.1677 3024.3523 3026.8470 3040.3174 3048.0586 3064.4839 3069.9127 3115.0344 3121.5797 3127.9096 3133.3104 3140.9522 3146.0867 3156.7800 3158.3000 3168.0024 3170.1466 3532.1814 3549.6137
redmass: 4.6536 4.6608 5.0448 4.5929 3.5264 4.1939 4.8520 5.7407 4.4385 5.2717 4.7057 5.2529 3.5340 5.3739 4.3156 2.7756 5.1167 4.0381 5.3066 2.5465 4.3848 2.3253 2.3346 2.9510 3.8818 3.1528 4.8393 2.8320 2.3456 3.4499 3.5188 3.3268 1.3002 1.3052 5.2007 5.4333 5.2621 3.5141 5.4520 4.1779 4.8913 1.8198 1.5929 3.8043 2.2402 1.5941 3.1703 2.5094 3.8901 1.7311 1.5619 1.7322 1.3895 2.3189 1.7633 3.2815 2.9934 1.4965 1.5144 1.4578 1.8315 1.7258 1.5393 4.6826 4.1664 1.3600 1.3436 2.7708 2.4867 2.1683 1.4570 1.7503 2.1948 1.6388 1.7176 2.0217 1.0468 2.4626 1.6995 1.0707 1.0581 1.1400 2.0920 1.1749 1.6001 1.3758 3.3646 1.4233 1.9597 1.2994 1.6577 1.3317 1.5129 1.3434 1.4281 1.4209 1.4495 1.5051 1.5363 1.7860 4.5174 9.0872 2.2158 2.2882 1.0996 1.2801 1.4073 1.2095 1.1124 1.3175 2.2161 1.7942 1.7097 6.4347 5.6236 7.9735 6.9988 6.0321 5.9873 7.5728 1.0675 1.0616 1.0665 1.0623 1.0622 1.0847 1.0934 1.0983 1.1028 1.1004 1.0975 1.0879 1.0871 1.0874 1.0867 1.0872 1.0927 1.0919 1.0961 1.0958 1.0999 1.1011 1.0767 1.0774
irintensity: 1.0315 1.2857 0.4744 0.3307 0.7317 0.6110 5.8429 2.1932 4.3701 1.1631 1.1074 1.7590 2.3140 0.2282 6.5242 2.2694 2.9637 4.6400 11.9812 2.5952 0.9469 0.5080 1.8036 0.7914 1.6107 0.7100 22.9902 3.1440 0.3233 9.1803 9.1362 1.7029 38.0448 97.9962 0.5206 2.5573 2.3432 2.3630 9.2580 3.0773 13.0675 51.8116 103.0504 16.1359 27.5187 2.5854 10.6771 14.8610 16.6453 1.5226 9.5132 3.5151 7.4437 6.9556 12.0574 25.4742 10.9131 11.6810 11.1031 1.5303 1.0576 0.3756 2.7351 0.2018 0.2407 0.5447 1.5565 5.1633 18.1384 4.4256 0.5215 0.1860 16.8803 11.4220 0.5451 7.4511 1.3256 3.7504 4.0865 0.3424 1.0069 9.6542 32.0872 0.8137 14.2683 8.0183 81.5976 24.8919 103.7837 16.3157 9.2730 0.2899 50.6496 6.2563 16.9377 0.6813 12.5266 52.9845 32.4846 92.0741 42.0292 3.7751 15.2321 15.9687 12.3394 123.1664 181.5390 35.2091 43.8660 85.1367 27.2270 69.7223 85.8171 113.2139 10.1079 158.6094 90.3107 30.7398 1.8501 53.9202 24.9985 49.5589 31.5182 19.1755 25.2346 41.2074 73.0021 50.3078 33.6764 69.9196 29.5715 29.7636 9.5594 9.1216 0.0765 1.3519 26.8515 18.8598 31.2506 17.5947 20.6014 25.8644 8.9431 26.4762
temp: 298.150 k
press: 1.00000 atm
elementType: 8 8 7 7 6 6 6 6 6 6 6 6 6 6 6 6 6 6 6 6 6 6 6 6 6 6 1 1 1 1 1 1 1 1 1 1 1 1 1 1 1 1 1 1 1 1 1 1 1 1
symmnumber: 1
zpe: 1081035.7 jmol-1
zpe.correction: 0.411745 hartree
zpe.thermalcorrener: 0.435353 hartree
zpe.thermalcorrenthalpy: 0.436297 hartree
zpe.thermalcorrgfe: 0.355208 hartree
zpe.sumelectzpe: -1110.841339 hartree
zpe.sumelectthermal: -1110.817731 hartree
zpe.sumelectthermalent: -1110.816786 hartree
zpe.sumelectthermalfe: -1110.897876 hartree
dipole: 0.4559 -2.0237 -2.9802
dipole: 3.6311
quadrupole: -123.1919 -142.7676 -158.6856
quadrupole: -8.8557 -1.6208 2.1941
quadrupole: 18.3565 -1.2192 -17.1372 -8.8557 -1.6208 2.1941
hfenergy: -1111.2530838 hartree
pointgroup: C01 [X(C22H24N2O2)]
dipole: 0.1253805 -0.6190318 -1.2813878 debye
polarizability: 411.1603025|22.1541515|244.3144489|11.6354126|12.7244737|185.3207034 unknown
InChI: InChI=1S/C22H24N2O2/c25-21(18-12-6-2-7-13-18)24-20(16-17-10-4-1-5-11-17)22(26)23-19-14-8-3-9-15-19/h1-2,4-7,10-13,16,19,23-24H,3,8-9,14-15H2
charge 0 multiplicity 1
50 atoms
O  -0.242666 -0.082176 1.981731
O  1.963347 1.013211 -0.290337
N  -1.191888 1.165531 0.252157
N  1.267727 -1.20839 -0.421265
C  -1.638045 2.291003 1.106669
C  -0.444008 3.194133 1.525235
C  -2.722053 3.105176 0.359291
C  0.134225 3.987911 0.331867
C  -2.142795 3.910809 -0.832356
C  -0.964438 4.809982 -0.385128
C  -0.507024 0.088911 0.748405
C  -0.124552 -0.967049 -0.283465
C  -1.02115 -1.770554 -0.946743
C  -2.483691 -1.863051 -0.789406
C  2.256351 -0.220814 -0.324163
C  3.67253 -0.720452 -0.29295
C  -3.181089 -1.480363 0.395362
C  -3.241786 -2.415433 -1.863835
C  -4.581931 -1.616037 0.478839
C  -4.642908 -2.546645 -1.779299
C  4.693743 0.163461 -0.727168
C  4.024453 -2.01187 0.182395
C  -5.322822 -2.141847 -0.60664
C  6.042526 -0.245628 -0.713947
C  5.37669 -2.418282 0.199044
C  6.387427 -1.540015 -0.256013
H  -2.068482 1.837443 2.020253
H  0.335133 2.564722 1.989616
H  -0.809129 3.896386 2.30322
H  -3.168293 3.814745 1.083592
H  -3.533869 2.430886 0.022668
H  0.609243 3.279681 -0.374419
H  0.938642 4.659323 0.689045
H  -2.945421 4.522443 -1.287876
H  -1.793013 3.223441 -1.632557
H  -0.539608 5.341161 -1.259074
H  -1.35002 5.587874 0.307203
H  -1.272251 1.25592 -0.762142
H  -0.595824 -2.463846 -1.689923
H  1.561823 -2.159937 -0.651121
H  -2.624391 -1.112066 1.262094
H  -2.720936 -2.734105 -2.775774
H  -5.097145 -1.325187 1.40133
H  -5.202977 -2.967987 -2.621642
H  4.405546 1.165723 -1.060849
H  3.259241 -2.683244 0.590406
H  -6.410836 -2.248106 -0.533656
H  6.824641 0.441009 -1.055479
H  5.642711 -3.410366 0.579694
H  7.43614 -1.856837 -0.241788
