program: Gaussian 09
title: 000005711
version: EM64L-G09RevD.01
frameworkgroup: C1[X(C14H21N3O)]
method: RPBEPBE
basis: SDD
operation: Freq
keyword: #p
keyword: freq=noraman
keyword: PBEPBE/SDD
title: #p freq=noraman PBEPBE/SDD
converged: NO YES NO NO
title: Mulliken charges:
elementType: O N N N C C C C C C C C C C C C C C H H H H H H H H H H H H H H H H H H H H H
charge: -0.241645 -0.606333 -0.447411 -0.016249 0.063600 -0.480097 -0.483399 -0.184581 -0.448126 -0.457390 -0.109152 0.170919 -0.737542 0.507410 -0.383796 -0.285711 -0.309665 -0.342157 0.225050 0.187672 0.216571 0.212945 0.189188 0.194067 0.234776 0.202341 0.203917 0.238682 0.184626 0.222161 0.230788 0.202927 0.267256 0.266428 0.304449 0.221416 0.304468 0.240073 0.241522
chargesum: 0.00000
title: Mulliken charges with hydrogens summed into heavy atoms:
elementType: O N N N C C C C C C C C C C C C C C
charge: -0.241645 -0.072649 -0.142962 -0.016249 0.288650 -0.075854 -0.081265 0.009487 -0.011009 -0.014791 0.075475 0.170919 -0.081665 0.507410 -0.162380 0.018757 -0.069592 -0.100636
polarizability: 2.57135806e+02 -4.41251862e+00 1.40107891e+02 2.49118757e+00 -1.65454555e+01 1.33290125e+02
1716.lowfreq: -12.8702 -6.5612 -0.0009 -0.0008 -0.0002 4.7510 16.8339 31.1137 37.9200
frequency: 15.4744 31.0424 37.8898 57.1877 84.7789 107.8790 139.3766 168.4056 193.1504 203.8937 213.4108 231.7386 251.4547 280.7568 303.0940 336.5020 367.4096 375.6448 379.8523 409.8769 436.5546 449.9887 493.8510 520.8992 538.8319 572.5769 614.9872 650.6026 658.9489 711.5388 741.2203 748.1875 784.5611 790.6160 829.5356 829.8324 867.1978 879.8191 887.4928 902.5707 930.3452 953.5863 954.2856 957.4304 972.6758 986.8149 991.0574 997.6278 1043.6702 1053.6898 1057.0056 1080.6509 1088.8840 1101.3141 1117.3402 1128.7690 1152.7228 1170.7164 1216.3724 1216.7480 1220.3113 1226.8609 1248.7259 1264.6106 1276.7588 1281.7139 1299.4677 1306.1402 1323.8211 1324.2165 1329.6299 1330.5123 1338.9725 1348.8080 1356.6799 1367.5372 1385.2526 1400.8621 1461.2915 1462.2925 1465.6181 1468.1369 1473.7976 1477.0329 1479.6615 1480.9025 1573.5948 1585.6243 1624.2276 1639.9602 2829.8891 2939.6219 2943.1140 2950.5408 2973.4997 2977.9776 2981.5138 2986.2194 3029.1156 3034.8607 3043.9437 3052.1707 3065.5706 3096.2499 3118.8891 3136.9334 3145.5223 3205.0956 3455.8422 3522.9361 3580.2644
redmass: 4.5617 4.3639 3.8620 2.7033 6.0787 4.0328 5.0556 4.4417 1.7082 2.5908 1.8384 1.9977 1.1818 4.5238 3.1434 6.0418 3.0155 2.5804 2.0844 2.9707 2.8239 3.1752 2.6637 1.8383 2.8267 6.0229 1.3820 1.1760 6.8927 8.0086 3.2989 3.7766 3.0342 1.5074 2.6420 1.7073 2.3009 1.2636 2.7902 1.3507 2.5645 2.5971 1.4262 4.1171 2.4686 1.3871 1.5360 1.8254 2.4489 1.1912 2.0891 1.9532 1.5584 2.6238 2.3813 2.1984 2.2590 2.2826 1.2978 1.3265 1.4465 1.3372 1.3417 2.0054 1.3429 1.3501 1.4742 1.5577 1.7834 1.4796 1.5156 1.5409 1.4562 1.5603 1.6651 1.5534 1.2262 1.9941 1.0862 1.9335 1.0848 1.0780 1.0696 1.0972 2.1470 1.1421 5.0220 5.1220 5.0270 1.0988 1.0808 1.0706 1.0778 1.0675 1.0799 1.0375 1.0605 1.0617 1.0940 1.0957 1.1028 1.1021 1.0977 1.0987 1.0879 1.0908 1.0979 1.0951 1.0451 1.0762 1.0969
irintensity: 0.0308 0.1282 0.0498 0.5515 7.2998 0.2232 1.9986 0.9489 4.0756 21.5009 4.6004 0.3066 51.1641 2.7370 6.2470 1.2205 6.5398 0.0010 2.2236 9.1585 1.1480 0.7130 18.7251 7.5981 34.2140 14.2227 161.2621 43.2821 0.8434 3.7725 0.4815 2.0502 1.1200 0.0946 21.5920 68.1475 4.8816 6.4512 0.3083 11.4755 29.1510 6.6757 1.9325 0.9182 2.0512 2.9385 0.5050 16.8812 0.2309 0.2169 0.6867 8.9653 5.0217 1.9505 22.0385 35.7615 60.5570 40.7970 16.4450 12.3194 7.2272 1.0874 0.0715 4.8814 8.9329 1.4057 10.6170 23.9679 54.2188 27.0400 10.8956 14.4031 12.5246 44.0706 0.7666 11.9589 26.0968 72.2944 3.4504 30.8924 8.9097 7.6523 18.0759 24.8578 359.8353 55.4940 153.2886 147.8608 92.5597 64.8697 83.4366 13.2299 36.8337 31.1888 44.6951 37.3768 32.7459 18.6583 64.7174 19.0858 16.1297 65.0200 47.5127 32.7201 10.1276 36.1412 16.6884 6.1329 2.0321 10.0914 0.0951
temp: 298.150 k
press: 1.00000 atm
elementType: 8 7 7 7 6 6 6 6 6 6 6 6 6 6 6 6 6 6 1 1 1 1 1 1 1 1 1 1 1 1 1 1 1 1 1 1 1 1 1
symmnumber: 1
zpe: 874249.7 jmol-1
zpe.correction: 0.332984 hartree
zpe.thermalcorrener: 0.350717 hartree
zpe.thermalcorrenthalpy: 0.351661 hartree
zpe.thermalcorrgfe: 0.285603 hartree
zpe.sumelectzpe: -784.206506 hartree
zpe.sumelectthermal: -784.188773 hartree
zpe.sumelectthermalent: -784.187829 hartree
zpe.sumelectthermalfe: -784.253887 hartree
dipole: 4.5853 3.4012 -3.2410
dipole: 6.5648
quadrupole: -128.8650 -109.1611 -105.4674
quadrupole: -0.3031 -0.4102 -1.7884
quadrupole: -14.3672 5.3368 9.0304 -0.3031 -0.4102 -1.7884
hfenergy: -784.5394903 hartree
pointgroup: C01[X(C14H21N3O1)]
dipole: 1.8013204 1.1452761 1.4541031 debye
polarizability: 257.0125163|0.7349931|129.5200594|-6.4664548|15.2021263|144.0012463 unknown
InChI: InChI=1S/C14H21N3O/c1-10(15)11-2-4-12(5-3-11)14(18)17-13-6-8-16-9-7-13/h6-12,17H,2-5,15H2,1H3
charge 0 multiplicity 1
39 atoms
O  -0.898576 -0.884984 -1.397731
N  5.869726 1.058169 -0.799916
N  -1.749957 0.347105 0.411109
N  -5.987335 -0.166188 0.10008
C  3.713863 -0.016929 -0.156494
C  2.913823 -0.704982 0.979768
C  2.940282 1.233202 -0.654376
C  0.700153 0.232905 0.087543
C  1.461695 -1.035732 0.567954
C  1.486867 0.909277 -1.066746
C  5.161705 0.346142 0.291356
C  -0.705865 -0.155347 -0.381909
C  5.99469 -0.902996 0.651524
C  -3.145393 0.149842 0.266729
C  -4.011888 0.754111 1.218738
C  -3.730295 -0.618486 -0.775911
C  -5.40276 0.569221 1.094312
C  -5.136528 -0.738038 -0.805419
H  3.807192 -0.721346 -1.010334
H  2.905304 -0.039304 1.87005
H  3.412671 -1.642334 1.288902
H  3.458592 1.671285 -1.528149
H  2.935922 2.002126 0.149664
H  0.637258 0.945997 0.939023
H  1.460067 -1.768116 -0.262495
H  0.924904 -1.505412 1.415525
H  0.968796 1.833765 -1.388518
H  1.482126 0.21906 -1.931763
H  5.069118 0.974907 1.21608
H  5.565699 -1.449515 1.50781
H  6.048854 -1.584503 -0.217036
H  7.028105 -0.617637 0.928726
H  6.887251 1.081763 -0.677941
H  5.495474 1.986534 -1.017177
H  -1.46536 0.927657 1.20401
H  -3.613199 1.357176 2.043691
H  -3.102867 -1.098704 -1.527339
H  -6.087864 1.025575 1.81781
H  -5.614254 -1.324766 -1.598252
