program: Gaussian 09
title: 000005652
version: EM64L-G09RevD.01
frameworkgroup: C1[X(C17H25NO3)]
method: RPBEPBE
basis: SDD
operation: Freq
keyword: #p
keyword: freq=noraman
keyword: PBEPBE/SDD
title: #p freq=noraman PBEPBE/SDD
converged: NO YES NO NO
title: Mulliken charges:
elementType: O O O N C C C C C C C C C C C C C C C C C H H H H H H H H H H H H H H H H H H H H H H H H H
charge: -0.239842 -0.432418 -0.270523 -0.229185 -0.444165 -0.360264 -0.521773 0.199264 -0.436369 -0.357568 -0.173688 -0.345959 0.232579 -0.334144 -0.695247 0.417613 -0.346216 -0.320336 -0.151786 -0.851428 -0.219303 0.233217 0.235566 0.267230 0.242364 0.248490 0.259559 0.225018 0.181723 0.193585 0.207618 0.225124 0.197782 0.195072 0.224574 0.211421 0.210312 0.217712 0.295663 0.328775 0.226391 0.257791 0.233303 0.284303 0.228885 0.249279
chargesum: 0.00000
title: Mulliken charges with hydrogens summed into heavy atoms:
elementType: O O O N C C C C C C C C C C C C C C C C C
charge: -0.239842 -0.103643 -0.270523 -0.229185 0.024617 0.149330 -0.013725 0.199264 -0.029628 0.043635 0.051436 0.046895 0.232579 -0.109570 -0.055802 0.417613 -0.050553 -0.093944 0.106006 -0.104937 0.029976
polarizability: 4.74320071e+02 -2.26055283e+01 1.87645463e+02 -1.74874568e+01 -1.70288570e+01 1.41598321e+02
1716.lowfreq: -22.6285 -5.4268 -0.0014 -0.0007 -0.0002 2.4270 9.2625 21.7627 27.4147
frequency: -10.5974 21.7448 27.1308 38.0054 47.9707 59.1001 69.9938 102.1853 104.9266 109.1650 120.4832 147.1632 151.7718 158.2879 162.4296 187.4070 202.2953 226.1172 243.6342 246.0169 263.3113 274.1927 303.8849 307.9568 311.4045 352.5732 373.8278 402.9319 414.9459 480.5340 500.4918 509.6162 534.5598 544.6101 574.5868 625.0023 633.4934 665.5206 703.5805 731.3736 783.6967 789.3547 806.1239 839.6454 847.0691 869.7115 879.1484 882.8535 909.0792 920.7651 927.8116 936.9756 955.1128 990.3973 998.9228 1016.4321 1021.3083 1030.5063 1033.0625 1045.0908 1067.6935 1068.0364 1080.4255 1087.8105 1103.7091 1138.7449 1157.6959 1179.7705 1188.6367 1191.4477 1201.4338 1205.6448 1215.7080 1229.5288 1244.6167 1258.2569 1262.1374 1273.1849 1282.7567 1285.4324 1287.5756 1305.2942 1316.7308 1321.1913 1338.5120 1347.5756 1350.3683 1357.1965 1361.5221 1383.2620 1392.6281 1402.5134 1448.6180 1462.3106 1464.1292 1468.2138 1476.8203 1477.3249 1478.3627 1486.7995 1488.3471 1491.8453 1540.2472 1589.6004 1616.9814 1633.0040 1643.3899 2956.9513 2961.1108 2971.0346 2973.9090 2983.7009 2999.4720 3003.9465 3005.3455 3018.3192 3023.5880 3025.5083 3048.3554 3056.3837 3070.0723 3073.7188 3073.9550 3083.9234 3087.4156 3093.7113 3099.3703 3104.0690 3120.1289 3123.5039 3154.2692 3542.6504
redmass: 4.8020 4.5951 4.7008 4.1775 3.8170 1.8327 2.7997 3.5056 3.6797 5.0298 3.3376 2.3998 2.4867 1.2316 2.4787 3.0401 2.7277 1.2031 2.7612 2.9293 1.8669 2.0723 3.2915 2.8745 3.3243 4.0110 7.4118 4.4272 3.1536 4.1539 3.5325 2.2652 2.4866 2.7112 4.7276 3.2433 3.4941 3.7962 4.9446 1.0785 1.4012 3.0391 1.7481 2.4114 2.1181 2.7648 1.4846 1.7282 1.8181 1.6012 1.9599 2.5590 1.1748 2.6011 3.5025 2.2472 2.4225 1.1114 1.7642 1.5119 2.4440 2.0056 2.5109 2.2010 1.7166 2.3284 1.4156 1.9692 1.7227 1.4348 1.5398 1.5004 1.9287 1.5335 1.5192 1.9304 1.3714 1.2549 1.3479 1.5909 1.0710 1.4926 1.3501 1.4097 1.4243 1.6905 1.5397 1.8863 1.3528 1.4962 1.2166 1.3680 1.0808 1.0727 1.0743 1.0713 1.0427 1.0897 1.0682 1.0651 1.0855 1.0851 10.4017 5.6648 5.2558 5.5418 11.2713 1.0632 1.0604 1.0601 1.0363 1.0396 1.0976 1.0666 1.0675 1.0848 1.0633 1.0996 1.0999 1.0969 1.1004 1.0962 1.0930 1.0902 1.0976 1.0969 1.0914 1.1027 1.0899 1.0953 1.0924 1.0663
irintensity: 0.1045 0.2870 1.1283 0.4917 4.1609 0.3559 1.7579 0.5248 1.9628 2.0477 0.9811 1.5968 2.4161 0.4354 1.5556 0.8341 0.6463 0.2848 0.1958 0.5047 32.6482 162.7722 4.0833 8.4988 75.6012 10.9804 1.0912 12.9791 2.1465 15.1906 1.5788 5.1741 3.3628 0.8813 6.1070 8.4099 50.3440 6.8445 7.4764 11.1616 0.5322 24.1007 8.1505 5.9644 19.6141 20.2445 5.6904 21.7223 25.9482 39.7783 1.2027 28.8239 13.2381 11.3436 5.7763 13.5230 7.3357 95.4468 10.5007 0.8822 1.7460 9.9613 99.9720 18.3223 7.4918 20.8636 124.3804 175.3242 85.8239 48.8061 41.3740 3.2666 59.3183 46.0666 18.2463 378.4166 5.8992 0.3126 1.9993 34.2624 0.2034 51.8795 4.2964 1.8396 1.8524 269.1595 39.1623 384.3215 41.3623 13.7165 11.5063 25.4873 10.5725 18.0995 4.7109 0.5321 12.7037 15.4718 3.9456 18.2737 17.3251 7.3595 355.2778 64.0166 49.1714 300.5209 256.1274 4.3244 8.2393 99.4894 35.9623 13.7911 1.1305 11.7943 26.1912 23.2682 40.2432 6.1560 69.4332 15.9565 79.1235 51.0141 35.8774 18.9980 21.1613 7.1572 0.9069 31.6550 22.6537 3.6271 44.3136 7.6046
temp: 298.150 k
press: 1.00000 atm
elementType: 8 8 8 7 6 6 6 6 6 6 6 6 6 6 6 6 6 6 6 6 6 1 1 1 1 1 1 1 1 1 1 1 1 1 1 1 1 1 1 1 1 1 1 1 1 1
symmnumber: 1
zpe: 1015179.4 jmol-1
zpe.correction: 0.386661 hartree
zpe.thermalcorrener: 0.409546 hartree
zpe.thermalcorrenthalpy: 0.410490 hartree
zpe.thermalcorrgfe: 0.332352 hartree
zpe.sumelectzpe: -941.600300 hartree
zpe.sumelectthermal: -941.577416 hartree
zpe.sumelectthermalent: -941.576471 hartree
zpe.sumelectthermalfe: -941.654610 hartree
dipole: -0.8464 1.3784 -0.3793
dipole: 1.6614
quadrupole: -90.8839 -140.0429 -126.1809
quadrupole: 3.0771 -1.6425 3.0554
quadrupole: 28.1520 -21.0070 -7.1450 3.0771 -1.6425 3.0554
hfenergy: -941.9869617 hartree
pointgroup: C01 [X(C17H25N1O3)]
dipole: -0.3466868 0.4945948 -0.2498764 debye
polarizability: 475.9798611|-15.0025304|178.6666793|-7.8337962|-24.7605966|148.9173145 unknown
InChI: InChI=1S/C17H25NO3/c1-3-4-9-15(19)13-14(2)8-5-6-10-16(20)18-12-7-11-17(18)21/h5-6,8,10,13,15,19H,3-4,7,9,11-12H2,1-2H3
charge 0 multiplicity 1
46 atoms
O  -4.836637 -1.510716 1.33197
O  5.056768 -2.494974 -0.401185
O  -3.537496 1.688691 -1.298889
N  -5.051618 0.338895 -0.177457
C  -7.426253 0.31883 -0.47061
C  -6.161052 1.176989 -0.719598
C  -7.056382 -0.539547 0.760738
C  -5.529105 -0.671135 0.70049
C  6.092963 -0.227102 -0.316173
C  6.191873 1.122213 0.434155
C  4.914936 -1.108614 0.144606
C  7.381902 1.985267 -0.043866
C  -3.708024 0.684485 -0.535264
C  3.563807 -0.516643 -0.20808
C  7.482894 3.332949 0.702716
C  2.340585 -0.972023 0.237055
C  -2.611437 -0.143756 -0.00245
C  1.1336 -0.279277 -0.214004
C  -1.3074 0.14944 -0.334862
C  2.203346 -2.158743 1.174907
C  -0.163055 -0.595814 0.139709
H  -8.319331 0.944081 -0.310279
H  -7.617019 -0.332053 -1.342011
H  -5.970525 1.401465 -1.780034
H  -6.1910 2.140461 -0.176591
H  -7.318043 -0.035851 1.711674
H  -7.518808 -1.539046 0.780357
H  7.024546 -0.804851 -0.163503
H  6.005964 -0.039153 -1.408291
H  6.294178 0.928815 1.522402
H  5.252363 1.69846 0.310166
H  4.996172 -1.281401 1.234383
H  8.322704 1.413713 0.089862
H  7.283237 2.170837 -1.133124
H  3.576593 0.34287 -0.897301
H  7.610429 3.175485 1.790344
H  6.567065 3.936462 0.557167
H  8.341389 3.930469 0.345054
H  -2.868445 -0.977957 0.657278
H  4.846522 -2.46431 -1.37045
H  1.287493 0.576323 -0.89011
H  -1.130361 1.005855 -1.002725
H  1.547963 -2.931756 0.731753
H  3.174846 -2.631751 1.377006
H  1.742764 -1.851707 2.133113
H  -0.355808 -1.443575 0.810653
