program: Gaussian 09
title: 000040105
version: EM64L-G09RevD.01
frameworkgroup: C1[X(C21H27N3S)]
method: RPBEPBE
basis: SDD
operation: Freq
keyword: #p
keyword: freq=noraman
keyword: PBEPBE/SDD
title: #p freq=noraman PBEPBE/SDD
converged: NO YES NO NO
title: Mulliken charges:
elementType: S N N N C C C C C C C C C C C C C C C C C C C C C H H H H H H H H H H H H H H H H H H H H H H H H H H H
charge: 0.233404 -0.103497 -0.060230 0.010360 -0.188023 -0.355913 -0.348662 -0.393119 -0.399429 -0.625330 0.597929 0.629432 -0.420645 -0.650996 -0.614661 0.583864 -0.483691 -0.253401 -0.247256 -0.492500 -0.366541 -0.691935 -0.693164 -0.187106 -0.370744 0.201099 0.188104 0.217685 0.230816 0.186962 0.195491 0.202347 0.203280 0.199535 0.222918 0.253338 0.241153 0.189845 0.221511 0.220019 0.209849 0.250768 0.239141 0.238415 0.227603 0.213753 0.211776 0.210816 0.213767 0.228364 0.230112 0.243386
chargesum: 0.00000
title: Mulliken charges with hydrogens summed into heavy atoms:
elementType: S N N N C C C C C C C C C C C C C C C C C C C C C
charge: 0.233404 -0.103497 -0.060230 0.010360 0.013077 0.049876 0.069116 0.004720 0.003387 -0.149074 0.597929 0.629432 -0.420645 -0.409842 0.016714 0.583864 -0.483691 -0.043552 0.003512 -0.253360 -0.128127 -0.038803 -0.040217 0.043006 -0.127358
polarizability: 3.63118909e+02 3.48143349e+01 2.18238796e+02 -1.22888047e+01 1.09801584e+01 2.24815906e+02
1716.lowfreq: -8.1488 -0.0013 -0.0011 0.0006 6.7571 11.6651 21.6116 28.9636 32.9834
frequency: 21.5957 28.7047 32.9398 51.5238 61.4094 81.1279 87.4162 114.7398 126.1429 150.9723 181.8032 189.9090 205.7672 213.2308 221.5782 237.5867 241.8355 249.5745 264.4877 282.2808 283.0142 310.8316 323.2757 343.2137 361.6291 378.9942 393.8745 407.5057 419.6346 449.8442 451.6137 482.2550 494.3953 495.7228 503.4975 539.6917 576.3164 610.0754 627.9494 639.9511 653.4545 682.3043 717.1433 742.2200 753.6966 758.6005 779.5925 793.3722 840.7047 844.3840 849.5012 855.3088 901.8326 910.7722 917.4058 926.0458 929.2813 949.0962 953.2222 963.1659 971.8420 994.3776 1010.0642 1029.9625 1033.2231 1047.4846 1051.5638 1057.8395 1074.7671 1081.2954 1083.4960 1112.7801 1115.8082 1125.3357 1130.6587 1136.6021 1148.9242 1150.0341 1152.9045 1178.2609 1183.3384 1195.3019 1209.4002 1223.9407 1241.8871 1249.6597 1258.7955 1272.4789 1283.8149 1289.3976 1306.0434 1309.0371 1318.2872 1324.6580 1336.6580 1341.7391 1353.7046 1359.1035 1375.3735 1375.9361 1378.3220 1388.8092 1394.8779 1402.2302 1417.4425 1426.1767 1429.8020 1450.1836 1452.4544 1458.5246 1462.4946 1465.0567 1467.0977 1467.3953 1472.4504 1473.7694 1479.5304 1481.8679 1488.0768 1542.4984 1574.4450 1575.3909 1605.3655 2814.5552 2846.2254 2852.7262 2861.4515 2863.7477 2877.7556 2974.0900 2976.7258 2980.9644 2988.8618 3015.4964 3021.8892 3028.5241 3035.8584 3051.3199 3062.5106 3066.5330 3073.5565 3073.6690 3077.2289 3081.4615 3107.1294 3119.1510 3121.0683 3135.4286 3145.1630 3169.7938
redmass: 4.4360 3.8307 3.4723 2.9774 4.1695 4.0832 4.2382 3.6241 4.2507 3.9744 3.2968 4.2394 2.8214 1.1231 1.1767 1.2311 3.1503 2.9592 2.6935 3.6872 2.4168 2.5238 2.9803 2.8946 2.9095 4.1085 2.4209 3.4231 4.4350 4.3561 4.6132 2.9861 3.4697 3.3121 3.4776 4.4283 3.1550 3.7194 3.8370 6.3513 4.0733 4.3136 3.8089 4.2692 3.3292 3.2730 5.0086 1.3682 1.3822 3.1521 1.5795 3.7518 2.4247 1.6260 1.1849 1.8042 1.6848 2.0695 1.4389 1.3769 1.4512 2.6990 2.4268 5.2698 2.6791 1.6405 3.2387 2.9126 1.6565 1.7380 1.6753 2.5718 2.0322 2.1044 1.8989 2.0259 2.1002 3.1531 2.1163 1.3941 1.6878 1.1029 1.4978 1.9449 1.6199 1.5266 1.6809 1.3589 1.5213 1.6080 1.2916 1.3272 1.8717 6.0454 1.5277 1.4374 1.5625 1.6158 1.4136 1.1967 2.0840 1.7721 1.2176 1.8668 2.3608 2.5522 1.1682 1.0792 1.0775 1.0776 1.1159 1.1391 1.0461 1.0511 1.8745 1.1070 1.0537 1.0537 1.1654 5.4128 6.7407 6.6666 6.0500 1.0810 1.0695 1.0627 1.0701 1.0669 1.0669 1.0348 1.0352 1.0844 1.0607 1.0729 1.0887 1.0906 1.1010 1.0868 1.0890 1.0999 1.0991 1.1009 1.1005 1.0997 1.0901 1.0894 1.0876 1.0902 1.0963 1.0994
irintensity: 0.3805 0.0408 0.6455 0.2375 0.2169 0.2067 0.0331 2.0739 1.6504 0.4485 0.3658 0.8478 0.8309 0.0597 0.0456 0.3969 1.3606 1.1979 0.4351 0.3140 0.8063 5.0104 0.1269 7.3052 4.7040 0.3902 0.2967 0.4004 1.0646 0.8357 3.2018 0.0907 0.9056 6.3897 0.7941 2.7603 3.4656 2.2278 1.8596 11.1063 6.1536 2.6746 0.9502 1.1262 16.5756 7.1267 33.1827 48.5656 30.8347 15.3204 0.4451 6.9708 6.8173 11.3617 3.1944 2.1884 5.7566 10.7324 0.0023 0.0694 0.4815 13.8904 40.0495 26.4843 6.1261 0.6323 24.3213 38.9386 25.5854 12.2272 14.1057 1.4050 40.9533 24.4936 12.4833 16.0948 25.3126 23.0426 21.5829 3.4354 11.2539 0.1988 8.2253 2.1493 4.2416 14.4122 3.2198 1.2197 18.3674 31.0458 3.7037 0.8406 12.1363 1.6436 6.2401 3.2021 6.8799 8.1925 3.7249 15.7752 0.3938 5.9515 10.6399 102.7357 11.3962 63.4725 1.4456 3.6303 0.0483 34.4036 14.0722 14.5375 3.4952 2.4520 28.9685 11.4584 14.8922 7.9251 45.0720 41.0417 12.4104 23.8357 0.1873 62.2787 61.6678 73.5490 40.2429 23.8965 255.6239 30.2051 36.7844 20.5668 24.0489 49.4553 51.1767 50.5896 16.6858 37.3440 17.1430 0.7583 125.9580 31.9972 23.2497 37.8979 16.1083 9.8545 15.3469 23.5012 14.6648 33.5799
temp: 298.150 k
press: 1.00000 atm
elementType: 16 7 7 7 6 6 6 6 6 6 6 6 6 6 6 6 6 6 6 6 6 6 6 6 6 1 1 1 1 1 1 1 1 1 1 1 1 1 1 1 1 1 1 1 1 1 1 1 1 1 1 1
symmnumber: 1
zpe: 1145615.4 jmol-1
zpe.correction: 0.436342 hartree
zpe.thermalcorrener: 0.460028 hartree
zpe.thermalcorrenthalpy: 0.460972 hartree
zpe.thermalcorrgfe: 0.382717 hartree
zpe.sumelectzpe: -1376.856988 hartree
zpe.sumelectthermal: -1376.833302 hartree
zpe.sumelectthermalent: -1376.832358 hartree
zpe.sumelectthermalfe: -1376.910613 hartree
dipole: 1.1043 1.1485 3.2184
dipole: 3.5912
quadrupole: -137.4586 -162.9377 -153.7246
quadrupole: -0.5363 -8.8477 -6.9166
quadrupole: 13.9150 -11.5641 -2.3509 -0.5363 -8.8477 -6.9166
hfenergy: -1377.2933302 hartree
pointgroup: C01[X(C21H27N3S1)]
dipole: 0.3616197 0.3690811 1.3150198 debye
polarizability: 356.5457842|47.3216473|223.3663198|-5.5921196|10.9553621|226.2615068 unknown
InChI: InChI=1S/C21H27N3S/c1-15(2)16-6-7-20-18(13-16)19(24-11-9-23(3)10-12-24)14-17-5-4-8-22-21(17)25-20/h4-8,13,15,19H,9-12,14H2,1-3H3
charge 0 multiplicity 1
52 atoms
S  -0.268546 -1.456308 -1.903301
N  -0.941762 0.952346 0.43709
N  -2.62549 3.27978 -0.010411
N  -2.593328 -2.517498 -1.413213
C  0.120371 0.117609 1.064548
C  -1.999373 1.339762 1.405068
C  -0.426737 2.159011 -0.260265
C  -3.140963 2.08287 0.691873
C  -1.573608 2.886127 -0.978176
C  -0.453619 -1.257179 1.55825
C  1.322604 -0.11125 0.152981
C  -1.565357 -1.856589 0.71556
C  1.250021 -0.843676 -1.06173
C  2.589817 0.3571 0.576872
C  -3.700614 4.074027 -0.633025
C  3.777096 0.155302 -0.169312
C  -1.565675 -1.977133 -0.704461
C  5.128491 0.682889 0.317807
C  2.426603 -1.065142 -1.819532
C  3.670525 -0.564405 -1.383849
C  -2.716676 -2.362389 1.37367
C  5.567241 -0.009671 1.636646
C  5.12162 2.226097 0.481741
C  -3.786222 -2.940087 0.656285
C  -3.682039 -2.988355 -0.750012
H  0.520383 0.631987 1.978669
H  -1.583515 1.997522 2.211138
H  -2.415012 0.433236 1.877923
H  0.326087 1.847831 -1.003406
H  0.060331 2.86888 0.455009
H  -3.639374 1.371397 -0.01567
H  -3.891031 2.403956 1.439658
H  -1.179973 3.798431 -1.464709
H  -1.978408 2.211573 -1.774974
H  -0.838697 -1.140127 2.588228
H  0.397201 -1.961624 1.630299
H  2.636543 0.910322 1.523962
H  -4.26428 3.516845 -1.424338
H  -3.271604 4.981515 -1.095043
H  -4.423074 4.392706 0.140336
H  5.880766 0.431891 -0.457179
H  2.36466 -1.640297 -2.750103
H  4.567134 -0.747783 -1.988383
H  -2.765249 -2.295685 2.467713
H  5.606984 -1.107375 1.51721
H  6.568591 0.342452 1.947505
H  4.860265 0.216006 2.456959
H  4.401978 2.540461 1.260574
H  6.122006 2.589449 0.781951
H  4.838855 2.727144 -0.461417
H  -4.67071 -3.33339 1.165698
H  -4.478238 -3.411357 -1.37251
