program: Gaussian 09
title: 000039971
version: EM64L-G09RevD.01
frameworkgroup: C1[X(C12H6Cl4O)]
method: RPBEPBE
basis: SDD
operation: Freq
keyword: #p
keyword: freq=noraman
keyword: PBEPBE/SDD
title: #p freq=noraman PBEPBE/SDD
converged: YES YES NO NO
title: Mulliken charges:
elementType: Cl Cl Cl Cl O C C C C C C C C C C C C H H H H H H
charge: -0.026009 -0.026982 -0.004577 -0.046860 -0.401579 0.438948 0.427228 -0.300689 -0.342712 -0.326578 -0.332235 -0.308993 -0.353775 0.412771 -0.103024 -0.190957 -0.220010 0.276626 0.277379 0.255903 0.263133 0.264345 0.368645
chargesum: 0.00000
title: Mulliken charges with hydrogens summed into heavy atoms:
elementType: Cl Cl Cl Cl O C C C C C C C C C C C C
charge: -0.026009 -0.026982 -0.004577 -0.046860 -0.032934 0.438948 0.427228 -0.300689 -0.066086 -0.326578 -0.054855 -0.308993 -0.097871 0.412771 -0.103024 0.072176 0.044335
polarizability: 2.35894662e+02 1.63129435e+00 1.67346770e+02 -3.34839627e+00 4.58558112e-01 1.14471908e+02
1716.lowfreq: -6.5766 -4.9307 -0.0015 -0.0014 -0.0001 3.8446 20.9875 48.4722 62.2644
frequency: 20.9579 48.4625 62.2619 82.5390 93.7713 140.5539 174.6707 193.5925 205.7946 222.5306 255.1945 291.5025 305.7009 312.9631 320.5452 335.7841 357.6348 423.1410 432.7191 456.7888 480.8719 527.3320 531.4046 579.9510 606.1405 650.5593 672.3481 693.7356 707.9268 728.0546 779.7961 813.0724 825.6030 879.6638 892.8494 902.3391 947.4415 1006.6022 1045.0509 1078.7365 1085.0238 1124.4140 1134.3957 1220.2176 1246.3073 1258.3289 1290.5438 1342.0014 1354.9490 1373.4739 1390.8595 1447.6090 1492.6094 1557.3744 1563.0874 1596.9571 1615.4861 3147.1956 3164.1132 3165.0213 3167.1108 3182.9524 3582.9189
redmass: 18.9180 8.3542 7.9790 16.2429 12.7844 26.9744 8.5090 7.4228 13.3622 6.3046 7.7298 9.1618 9.5670 14.5284 10.6318 3.0182 1.5015 4.2813 3.6576 4.2885 4.9140 8.9016 7.2003 6.1542 6.0118 8.1342 7.0973 6.7499 3.3328 4.3767 7.1614 1.3523 1.6142 1.4228 1.5511 6.8396 1.3467 8.2532 4.7479 3.0933 1.7718 1.5409 1.3873 1.6796 1.3985 1.3644 3.3504 5.0637 6.2643 5.5482 5.5626 2.7477 4.2981 6.7581 6.7963 8.3072 8.3339 1.0924 1.0890 1.0927 1.0929 1.0980 1.0663
irintensity: 0.1211 0.9603 0.4539 0.3918 0.4654 0.2044 0.2058 0.6766 1.0141 2.4092 7.3975 0.3950 1.3521 0.2367 0.9227 35.5885 102.6856 9.8156 8.1924 4.5719 23.6639 37.2241 11.3264 9.1621 19.0166 6.5264 3.8695 5.8615 4.5279 6.8659 17.3014 41.6839 25.7101 18.9910 11.0260 35.8060 0.0352 62.2858 82.9460 24.2620 24.9136 232.0290 46.0206 10.2600 27.1185 41.6693 9.3153 69.9809 12.5509 10.2193 21.9476 124.4254 83.2291 9.2056 0.3020 1.4545 57.3059 3.1121 0.3491 0.1573 0.2037 1.3805 67.8720
temp: 298.150 k
press: 1.00000 atm
elementType: 17 17 17 17 8 6 6 6 6 6 6 6 6 6 6 6 6 1 1 1 1 1 1
symmnumber: 1
zpe: 374368.6 jmol-1
zpe.correction: 0.142589 hartree
zpe.thermalcorrener: 0.158349 hartree
zpe.thermalcorrenthalpy: 0.159293 hartree
zpe.thermalcorrgfe: 0.097277 hartree
zpe.sumelectzpe: -2375.147570 hartree
zpe.sumelectthermal: -2375.131810 hartree
zpe.sumelectthermalent: -2375.130866 hartree
zpe.sumelectthermalfe: -2375.192882 hartree
dipole: -0.2498 -1.5373 -0.8538
dipole: 1.7762
quadrupole: -115.5025 -128.4766 -124.3232
quadrupole: 6.5570 14.3949 1.9645
quadrupole: 7.2649 -5.7092 -1.5558 6.5570 14.3949 1.9645
hfenergy: -2375.290159 hartree
pointgroup: C01 [X(C12H6Cl4O1)]
dipole: 0.1098268 0.6088842 -0.3248373 debye
dipolederiv: -0.2828937 0.2063987 -0.132498 0.2353732 -0.4161661 0.2584308 -0.1494324 0.2669656 -0.2242329 -0.274379 -0.2202522 -0.1520453 -0.2173338 -0.4099949 -0.2685011 -0.143551 -0.2724479 -0.2401962 -0.3107039 0.2350608 -0.1319909 0.3568012 -0.4105849 0.2272379 -0.2112856 0.2351678 -0.1726588 -0.4039617 -0.2680562 -0.1541948 -0.3647732 -0.453236 -0.2471814 -0.2254151 -0.2529924 -0.2208947 -1.5892606 -0.0572704 0.1826496 -0.0465169 -0.1457279 -0.1562046 0.1915767 -0.157261 -0.3083352 0.0721244 0.0540887 -0.1022402 0.0579671 -0.2196246 0.1014171 -0.1177372 0.124926 -0.1084788 0.363815 -0.0527896 -0.1422441 0.0033115 -0.0848966 -0.0328637 -0.11013 -0.0496836 -0.023426 0.4011102 -0.2302684 0.1428591 -0.2620932 0.6229653 -0.4721686 0.196345 -0.4591498 0.2958146 -0.0166801 -0.0250983 0.0171108 -0.0144606 -0.0820423 0.0119535 -0.0509239 0.0086781 -0.0476242 0.174952 0.3782675 0.2959121 0.3037001 0.5375208 0.4424005 0.2155932 0.4133326 0.2565161 -0.270528 -0.0922073 -0.0392737 -0.1038328 -0.1549455 -0.0360731 -0.0536461 -0.0339006 -0.0879501 0.112134 -0.3616516 0.2324011 -0.6916553 0.5560514 -0.3731922 0.4850761 -0.4090659 0.1294581 -0.4213023 -0.0134318 0.0324337 0.2531252 -0.1754057 0.0073694 -0.1539041 0.0356663 -0.1527273 1.4308351 0.172589 -0.2752449 0.1235954 -0.0120161 0.0631185 -0.2443072 0.0592321 0.1003547 0.4833295 0.4419085 0.2599232 0.538529 0.6130507 0.4284942 0.3643729 0.4360854 0.2134154 -0.0570063 -0.0839113 -0.0801591 -0.0553027 -0.11024 -0.0243854 -0.0631007 -0.0137419 -0.0966731 -0.0810915 -0.0909411 -0.0661697 -0.1010065 -0.1777588 -0.0350202 -0.0747716 -0.0362746 -0.1232374 0.0955278 -0.0338587 0.0231796 -0.0497259 0.0591196 0.063985 0.037805 0.054384 0.0906318 0.0904206 0.0346119 0.0271558 0.0534798 0.0639412 -0.0685503 0.0419366 -0.058331 0.088097 0.000964 -0.0328902 0.0476175 -0.0408271 0.0650059 0.0829422 0.0417382 0.0820573 0.1096779 0.0531404 0.0170265 0.0295239 0.033256 0.0536378 -0.0843114 0.0354519 -0.0822243 0.0912413 -0.0325281 -0.0141788 0.0163681 -0.0231845 0.1154534 -0.0355822 0.0121082 -0.0334747 0.1395896 0.461982 0.0368543 -0.0310737 0.011574 0.1658934 0.1466849 -0.0237991 0.1420524 0.2916383 unknown
polarizability: 235.4372212|1.7294735|167.3573289|8.112993|0.2287945|114.9187901 unknown
InChI: InChI=1S/C12H6Cl4O/c13-6-1-2-9(14)7(3-6)8-4-11(16)12(17)5-10(8)15/h1-5,17H
charge 0 multiplicity 1
23 atoms
Cl 0.195732 2.324031 -1.709569
Cl -0.800009 2.271208 1.818269
Cl 3.582973 -2.310742 1.163595
Cl -4.166793 -2.306025 -1.173805
O  4.676395 -0.092408 -0.511829
C  0.442084 0.054921 -0.070625
C  -1.04099 0.045721 0.117505
C  1.12514 1.020642 -0.846978
C  1.229589 -0.965316 0.52684
C  -1.728485 0.987237 0.924332
C  -1.812658 -0.966933 -0.512567
C  2.624229 -0.99869 0.37127
C  2.521431 1.004397 -1.013364
C  3.290349 -0.011454 -0.3960
C  -3.208088 -0.999925 -0.342441
C  -3.127003 0.953513 1.089204
C  -3.884307 -0.050344 0.446574
H  0.738676 -1.73035 1.135556
H  -1.31214 -1.707264 -1.143276
H  3.006913 1.772537 -1.625125
H  -3.622571 1.698048 1.718158
H  -4.970532 -0.08857 0.564863
H  5.036863 0.651367 -1.055988
