program: Gaussian 09
title: 000039952
version: EM64L-G09RevD.01
frameworkgroup: C1[X(C17H13NO5)]
method: RPBEPBE
basis: SDD
operation: Freq
keyword: #p
keyword: freq=noraman
keyword: PBEPBE/SDD
title: #p freq=noraman PBEPBE/SDD
converged: YES YES NO NO
title: Mulliken charges:
elementType: O O O O O N C C C C C C C C C C C C C C C C C H H H H H H H H H H H H H
charge: -0.269258 -0.265140 -0.255326 -0.407651 -0.235324 -0.057065 0.550070 -0.349261 0.032255 0.232828 -0.500352 0.363840 0.060665 -0.441274 -0.360600 0.213330 -0.694498 -0.468843 0.164677 -0.378052 -0.321695 0.179256 -0.203765 0.248756 0.289855 0.238991 0.254125 0.229628 0.245935 0.224290 0.285451 0.277469 0.256994 0.240644 0.242504 0.376542
chargesum: 0.00000
title: Mulliken charges with hydrogens summed into heavy atoms:
elementType: O O O O O N C C C C C C C C C C C C C C C C C
charge: -0.269258 -0.265140 -0.255326 -0.031110 -0.235324 -0.057065 0.550070 -0.100505 0.032255 0.232828 -0.210497 0.363840 0.060665 -0.202283 -0.106475 0.213330 0.005356 -0.183392 0.164677 -0.100583 -0.064701 0.179256 0.279383
polarizability: 4.12341577e+02 1.53886494e+01 1.93115268e+02 6.21875087e+00 -8.33941775e+00 1.09919821e+02
1716.lowfreq: -7.5321 -5.6648 -0.0004 0.0003 0.0008 5.1754 6.8573 22.9481 29.9446
frequency: -4.0542 22.9239 29.7730 39.8577 53.5387 58.7418 79.1879 119.4633 152.8303 195.9587 218.0522 220.0131 229.5786 250.9118 263.1653 269.5588 330.5975 341.5655 383.7202 401.5478 422.0712 429.7356 440.9062 512.9701 527.2743 558.1022 583.0010 592.0567 613.9143 625.8286 645.5814 665.8490 685.2351 692.9316 707.7098 730.0715 754.5500 766.0470 777.3119 798.3240 814.5803 827.6405 831.9054 834.9861 840.8594 872.9940 893.7875 913.7306 927.3087 946.5058 961.5329 971.5801 990.7246 1002.3720 1035.5640 1063.1134 1065.3935 1066.0672 1096.0611 1117.5028 1120.8142 1134.5834 1142.2292 1173.9247 1203.8655 1227.5231 1240.1721 1261.3728 1265.0802 1281.9723 1305.8444 1346.8882 1364.3976 1385.4553 1393.2202 1399.7560 1429.6928 1440.3000 1461.0442 1464.2880 1471.9607 1476.6216 1487.1562 1555.5735 1601.9780 1612.7726 1622.8655 1627.8646 1659.7527 2994.5182 3016.8068 3048.1882 3091.6381 3097.9873 3108.0674 3139.0676 3161.6394 3167.3470 3177.4604 3188.4487 3194.6291 3503.7727
redmass: 2.2368 6.5601 6.4027 8.8516 5.6036 6.2029 7.7901 6.0136 5.7706 4.9994 2.0464 1.5699 5.8687 5.4287 5.2279 6.6036 6.6891 6.0560 5.9135 5.4354 3.4464 4.2162 3.2104 5.1340 5.7390 5.8245 5.3025 3.8088 4.3736 1.9946 2.5624 8.1576 9.3460 7.1317 4.5144 4.1161 4.6452 5.2820 5.6222 3.6037 2.4531 1.8507 1.4556 6.4837 10.4478 8.7723 1.4486 1.5329 3.0916 1.3606 1.3453 7.4639 3.1815 2.2539 2.3188 3.3371 1.7384 1.4577 2.3239 2.2340 1.0396 2.2522 1.3537 2.0218 2.0912 1.9890 2.3437 1.4432 1.6333 3.5316 1.7132 1.9716 1.3420 4.4750 1.2000 3.6283 3.9009 4.1123 2.3598 2.9600 1.1762 1.0567 1.2293 8.2223 8.0830 8.6097 8.1731 7.7652 8.1536 1.0354 1.0540 1.0851 1.1001 1.1185 1.1003 1.0896 1.0932 1.0896 1.0962 1.0966 1.0939 1.0638
irintensity: 14.5622 0.1342 0.4789 2.8151 0.8172 0.4080 0.7169 0.6246 0.9117 0.3120 0.1024 1.0962 0.5456 0.1211 0.9880 0.2920 2.0921 2.3910 3.9269 10.8552 4.3717 3.7350 8.0276 12.2693 11.9616 5.6950 6.8742 17.7317 16.7984 95.5971 58.1073 2.9413 0.2760 20.2571 40.4480 7.9983 1.5890 9.8845 9.2276 42.1530 21.3214 31.0399 27.9482 36.3387 8.9334 24.7153 30.2832 16.8081 29.9599 1.2932 0.2040 192.5426 44.2264 22.0904 279.1786 44.6892 23.0865 4.8133 40.0544 12.7993 0.2230 0.8009 11.1456 16.5303 43.3611 92.6222 121.8519 35.1174 68.2629 46.6108 2.4068 44.8598 6.9763 2.6616 21.0384 4.6526 79.5854 31.8661 31.3053 367.2257 12.1435 13.1776 28.7781 93.0977 5.2869 4.3474 10.6166 24.1935 174.7188 29.6727 149.8631 6.8975 41.7140 29.8252 16.6827 8.0988 0.0817 0.8245 5.8856 3.6949 2.0833 24.0249
temp: 298.150 k
press: 1.00000 atm
elementType: 8 8 8 8 8 7 6 6 6 6 6 6 6 6 6 6 6 6 6 6 6 6 6 1 1 1 1 1 1 1 1 1 1 1 1 1
symmnumber: 1
zpe: 695707.5 jmol-1
zpe.correction: 0.264981 hartree
zpe.thermalcorrener: 0.283491 hartree
zpe.thermalcorrenthalpy: 0.284435 hartree
zpe.thermalcorrgfe: 0.215999 hartree
zpe.sumelectzpe: -1084.851970 hartree
zpe.sumelectthermal: -1084.833460 hartree
zpe.sumelectthermalent: -1084.832516 hartree
zpe.sumelectthermalfe: -1084.900952 hartree
dipole: -0.9868 2.1577 -0.3689
dipole: 2.4012
quadrupole: -99.1542 -132.8167 -129.5540
quadrupole: 6.2867 -0.1048 1.7601
quadrupole: 21.3541 -12.3084 -9.0457 6.2867 -0.1048 1.7601
hfenergy: -1085.1169511 hartree
pointgroup: C01 [X(C17H13N1O5)]
dipole: 0.3728567 -0.8500209 -0.1758157 debye
polarizability: 412.5513037|12.3465561|192.1139366|-9.8146455|10.7381639|110.7114258 unknown
InChI: InChI=1S/C17H13NO5/c1-9(17(19)20)10-2-4-13-12(6-10)18-16(23-13)11-3-5-14-15(7-11)22-8-21-14/h2-7,9,19H,8H2,1H3
charge 0 multiplicity 1
36 atoms
O  0.378273 -1.329256 -0.058109
O  5.608052 -1.375035 -0.359585
O  6.396659 0.878338 -0.084155
O  -6.183311 0.41274 -1.661056
O  -5.396593 2.179099 -0.377432
N  -0.17179 0.899887 0.31132
C  -3.698565 -0.493317 0.294345
C  -5.186389 -0.146714 0.472545
C  -1.36163 0.130375 0.262897
C  -1.026665 -1.236385 0.036129
C  -2.709449 0.516093 0.395852
C  2.256653 0.277559 0.073759
C  0.821134 0.035237 0.122873
C  -3.328687 -1.851108 0.061082
C  -1.978154 -2.254203 -0.07118
C  4.519669 -0.487155 -0.173515
C  -5.505329 0.306859 1.920565
C  3.166241 -0.807105 -0.137091
C  4.987767 0.836648 -0.010966
C  2.730506 1.60942 0.237715
C  4.113237 1.908718 0.197737
C  -5.579332 0.949615 -0.515565
C  6.826672 -0.524347 -0.351726
H  -5.784009 -1.039429 0.221167
H  -2.978626 1.564188 0.558258
H  -4.116988 -2.607751 -0.02167
H  -1.702273 -3.296374 -0.249911
H  -5.190255 -0.471967 2.635993
H  -4.972598 1.242177 2.160906
H  -6.587735 0.486766 2.04953
H  2.806137 -1.830023 -0.2620
H  1.997319 2.405505 0.395424
H  4.483283 2.928825 0.322921
H  7.304756 -0.566705 -1.345851
H  7.492699 -0.854214 0.462821
H  -6.385578 1.149241 -2.301027
