program: Gaussian 09
title: 000039955
version: EM64L-G09RevD.01
frameworkgroup: C1[X(C17H12F3NO3)]
method: RPBEPBE
basis: SDD
operation: Freq
keyword: #p
keyword: freq=noraman
keyword: PBEPBE/SDD
title: #p freq=noraman PBEPBE/SDD
converged: YES YES NO NO
title: Mulliken charges:
elementType: F F F O O O N C C C C C C C C C C C C C C C C C H H H H H H H H H H H H
charge: -0.164323 -0.161817 -0.162339 -0.264321 -0.407140 -0.232838 -0.049250 -0.351483 0.548429 0.032852 0.230004 -0.493064 -0.435939 0.073793 -0.358212 0.338164 -0.692712 0.181146 -0.454701 0.301575 -0.348284 -0.370986 -0.207044 0.240806 0.250286 0.293591 0.241757 0.256680 0.229938 0.246295 0.226697 0.300110 0.271375 0.270916 0.241665 0.378374
chargesum: 0.00000
title: Mulliken charges with hydrogens summed into heavy atoms:
elementType: F F F O O O N C C C C C C C C C C C C C C C C C
charge: -0.164323 -0.161817 -0.162339 -0.264321 -0.028766 -0.232838 -0.049250 -0.101197 0.548429 0.032852 0.230004 -0.199473 -0.194182 0.073793 -0.101532 0.338164 0.010218 0.181146 -0.154591 0.301575 -0.076909 -0.100070 0.034621 0.240806
polarizability: 3.61340217e+02 -9.68979482e+00 1.98827446e+02 6.75241377e+00 -7.48008761e+00 1.09894998e+02
1716.lowfreq: -4.4763 -3.7197 0.0006 0.0007 0.0010 3.6370 11.6206 20.8921 32.2136
frequency: 9.0868 20.7773 32.1851 40.0673 46.9486 49.2845 85.4516 121.4227 131.6739 151.1369 186.7280 209.3571 216.4741 227.8581 247.1352 284.9825 296.7793 308.3728 326.3721 348.8753 377.8237 383.9619 414.5118 429.8207 437.8356 477.9006 507.5690 523.2383 544.5966 585.0961 593.9907 608.2465 612.3275 626.5226 647.3237 667.3688 696.7516 703.2272 708.8027 745.4100 756.8213 776.7331 806.6742 817.5085 820.0160 829.4066 851.4810 918.2154 926.8907 938.5861 946.6349 950.6954 985.5054 990.7517 993.7151 1002.1324 1003.2605 1010.9782 1037.0875 1064.7907 1065.8491 1096.7402 1105.3897 1120.3204 1135.4614 1174.8080 1188.0710 1213.5550 1234.6935 1249.2260 1264.3840 1289.3872 1307.8917 1309.6574 1347.5114 1391.7910 1392.9438 1398.9441 1428.1357 1436.1485 1461.6696 1465.8205 1471.8274 1476.3336 1546.2934 1595.8616 1609.8493 1620.5763 1629.1659 1660.0750 2995.7527 3050.7226 3093.6254 3108.8039 3141.3897 3151.6431 3164.7142 3165.4088 3171.1580 3179.9747 3182.3425 3503.3733
redmass: 16.8622 5.9879 6.9955 8.6751 6.1934 6.1200 7.2171 6.4512 5.5793 7.6421 4.8294 3.6540 1.1326 6.5584 4.9566 5.7201 5.5759 5.9565 7.5992 8.3146 5.9246 6.3366 4.9092 4.6279 3.6309 5.1353 8.6920 4.6153 7.2621 3.9701 7.0255 7.9900 4.5433 2.0468 2.5281 7.8416 3.4051 2.9965 4.6002 7.5683 4.7673 4.1598 3.1628 3.2397 1.5223 1.7767 12.3231 1.6636 2.6329 1.4857 1.4446 1.3634 7.8274 7.4783 7.7232 2.2649 1.4225 5.8601 2.3390 1.8560 2.2489 2.2828 1.8686 2.1378 2.4291 1.9721 1.1032 2.6127 1.6273 3.2591 1.4143 2.8041 1.5637 1.6167 1.9924 9.5726 1.1977 3.6017 3.6681 3.3740 2.2032 2.6250 1.2243 1.0579 8.1127 6.4309 7.6112 7.1132 7.3004 8.1634 1.0352 1.0853 1.1003 1.1004 1.0898 1.0876 1.0932 1.0934 1.0927 1.0962 1.0992 1.0638
irintensity: 0.0182 0.0318 2.0788 0.8911 0.3697 0.9244 0.9005 0.3948 0.3407 0.9491 0.3572 0.3143 0.5033 0.4162 1.3287 0.5632 0.0742 1.3046 5.3578 6.7627 3.7642 3.3990 3.0393 0.5591 3.5898 4.5410 6.1877 16.5108 1.0752 7.8541 0.8322 34.7572 16.9061 88.5109 68.1250 3.1074 5.6512 44.8322 31.4428 15.3731 3.1858 18.0959 56.2297 44.8441 54.0564 22.1786 19.2244 15.4945 18.2130 42.9642 0.7033 1.1417 17.6303 121.0237 77.4792 16.9640 4.1210 144.5708 284.2288 27.1798 116.6491 41.5993 2.4941 8.5099 2.9487 85.8057 2.1528 60.1765 54.2183 87.6751 1.8023 115.8371 0.4880 40.4344 40.9585 3.7912 21.4550 16.5492 8.5029 58.2519 9.6767 15.1219 15.9865 13.2971 31.3585 2.9950 3.1381 0.8276 2.2028 172.8736 26.4726 6.4058 38.5863 16.5290 7.3393 8.3494 0.6874 0.1978 0.4216 5.0029 6.5799 25.7270
temp: 298.150 k
press: 1.00000 atm
elementType: 9 9 9 8 8 8 7 6 6 6 6 6 6 6 6 6 6 6 6 6 6 6 6 6 1 1 1 1 1 1 1 1 1 1 1 1
symmnumber: 1
zpe: 667866.0 jmol-1
zpe.correction: 0.254377 hartree
zpe.thermalcorrener: 0.275145 hartree
zpe.thermalcorrenthalpy: 0.276089 hartree
zpe.thermalcorrgfe: 0.200719 hartree
zpe.sumelectzpe: -1233.289447 hartree
zpe.sumelectthermal: -1233.268679 hartree
zpe.sumelectthermalent: -1233.267735 hartree
zpe.sumelectthermalfe: -1233.343105 hartree
dipole: 3.2961 5.3335 -0.3906
dipole: 6.2820
quadrupole: -124.6908 -136.0321 -135.8370
quadrupole: -12.2218 1.2965 1.1760
quadrupole: 7.4959 -3.8455 -3.6504 -12.2218 1.2965 1.1760
hfenergy: -1233.5438238 hartree
pointgroup: C01 [X(C17H12F3N1O3)]
dipole: 1.2927882 2.0969959 -0.1992837 debye
polarizability: 361.2025863|-8.880602|198.2668192|9.9221625|-10.1083464|110.593256 unknown
InChI: InChI=1S/C17H12F3NO3/c1-9(16(22)23)10-5-6-14-13(8-10)21-15(24-14)11-3-2-4-12(7-11)17(18,19)20/h2-9,22H,1H3
charge 0 multiplicity 1
36 atoms
F  -6.441666 -1.358415 -0.203203
F  -4.617066 -2.549782 -0.839857
F  -4.967925 -2.106293 1.350278
O  0.08903 2.010108 -0.118735
O  6.188161 -1.094265 -1.563308
O  4.93567 -2.675468 -0.414685
N  0.114222 -0.292612 0.190929
C  5.224841 -0.403474 0.547185
C  3.860119 0.271765 0.334285
C  1.447688 0.190106 0.205516
C  1.434583 1.602606 0.015231
C  2.668406 -0.4928 0.368273
C  3.810808 1.684417 0.135414
C  -0.648785 0.777724 0.002189
C  2.592107 2.384563 -0.027105
C  -2.103187 0.859071 -0.095219
C  5.367927 -0.976261 1.981488
C  5.40945 -1.519992 -0.479427
C  -2.866115 -0.331331 0.010645
C  -4.271569 -0.264683 -0.08214
C  -2.759017 2.104692 -0.293413
C  -4.929758 0.972076 -0.279083
C  -4.163789 2.153625 -0.384884
C  -5.062403 -1.536758 0.049562
H  6.016175 0.342563 0.362699
H  2.690369 -1.578516 0.502043
H  4.7509 2.246464 0.104947
H  2.56362 3.466234 -0.17875
H  5.203031 -0.177021 2.724232
H  4.629887 -1.777202 2.15499
H  6.375847 -1.400152 2.138396
H  -2.347263 -1.283684 0.15924
H  -2.162425 3.017934 -0.374762
H  -6.020406 1.005689 -0.351871
H  -4.666899 3.113119 -0.539176
H  6.254432 -1.831045 -2.231022
