program: Gaussian 09
title: 000039975
version: EM64L-G09RevD.01
frameworkgroup: C1[X(C14H9ClFNO5)]
method: RPBEPBE
basis: SDD
operation: Freq
keyword: #p
keyword: freq=noraman
keyword: PBEPBE/SDD
title: #p freq=noraman PBEPBE/SDD
converged: YES YES NO NO
title: Mulliken charges:
elementType: Cl F O O O O O N C C C C C C C C C C C C C C H H H H H H H H H
charge: 0.011182 -0.191657 -0.279941 -0.256297 -0.222361 -0.203513 -0.195049 0.023101 0.264308 0.363622 0.256823 -0.470509 -0.360139 -0.325572 0.427561 0.155367 -0.251640 -0.289232 -0.374710 -0.358725 0.353095 -0.497751 0.292043 0.273748 0.287256 0.271400 0.290600 0.269535 0.256247 0.236864 0.244345
chargesum: 0.00000
title: Mulliken charges with hydrogens summed into heavy atoms:
elementType: Cl F O O O O O N C C C C C C C C C C C C C C
charge: 0.011182 -0.191657 -0.279941 -0.256297 -0.222361 -0.203513 -0.195049 0.023101 0.264308 0.363622 0.256823 -0.178465 -0.086391 -0.038317 0.427561 0.155367 -0.251640 -0.017833 -0.084110 -0.089191 0.353095 0.239706
polarizability: 2.61442281e+02 2.61883314e+01 1.77112050e+02 -9.04050450e+00 7.47831193e+00 1.45025325e+02
1716.lowfreq: -3.9672 0.0010 0.0012 0.0013 3.6082 5.5412 16.5869 20.2601 30.3918
frequency: 16.4273 20.1906 30.3687 36.1622 73.2285 82.9516 90.2725 93.8486 118.0964 127.5475 170.9960 187.0005 205.3042 230.3847 249.8115 271.4857 281.9089 322.1119 323.9491 337.4431 367.2890 399.2006 417.6200 443.6187 445.5230 492.0116 515.2568 551.4780 557.8732 582.7666 629.6829 647.2898 659.0279 667.6885 693.7714 706.1426 735.6191 748.1063 768.6968 785.4711 816.8196 846.4865 854.8917 858.6276 884.4197 897.1910 940.4196 954.1288 979.3767 1024.6333 1042.2543 1107.4384 1116.3507 1120.2519 1135.3168 1152.2831 1153.3333 1174.8937 1216.8836 1234.6120 1239.8310 1243.1887 1276.0373 1362.9940 1364.8492 1390.7294 1403.0613 1412.8692 1422.6754 1452.7574 1463.3369 1463.6564 1470.3264 1587.4119 1590.2462 1599.3946 1606.3894 1632.5098 3008.6701 3114.3481 3156.3684 3167.1822 3169.1552 3173.3324 3188.4721 3190.7234 3191.3196
redmass: 10.1786 9.1694 8.5362 9.3631 1.8318 7.7719 6.4461 1.6450 6.4951 5.6742 9.4617 9.0733 10.7144 7.4274 6.7813 6.4255 7.8971 9.6259 5.9999 6.8843 8.5347 8.4757 7.7675 3.7061 3.5637 6.4099 7.9531 5.3800 7.0187 4.5053 5.8540 6.7936 4.7483 7.8098 6.1798 6.1841 5.1073 4.8496 6.8581 8.3494 1.5079 1.4704 4.7648 1.5941 6.6748 1.6458 1.3866 4.9057 1.3449 2.9216 4.7252 1.8513 1.5060 1.3117 1.7696 1.8602 1.5188 3.0505 6.8641 4.4662 1.8795 2.1387 1.8866 9.6719 8.0747 4.3717 7.5907 3.4234 1.3547 1.0512 3.0093 1.0528 3.0241 8.1731 8.3625 7.7000 6.8083 10.6807 1.0292 1.1051 1.1050 1.0921 1.0897 1.0891 1.0940 1.0975 1.0974
irintensity: 0.0645 0.2756 1.5973 0.1497 2.1697 0.7485 4.6477 1.0871 1.1402 0.5655 2.1929 0.2531 1.5815 1.0061 3.6207 10.9567 1.4180 1.4295 5.4370 2.1846 6.8256 4.9702 3.6996 0.6451 11.6614 3.4224 3.5372 8.7632 8.0903 5.4050 8.1306 5.3764 6.3209 5.2886 8.3126 10.7845 18.8797 4.1136 39.1110 4.9908 31.0117 35.1790 37.4335 55.0463 27.5580 16.4988 0.8220 64.7364 0.8768 36.1315 66.7531 39.1256 11.5336 5.9123 22.3360 89.8091 62.6915 223.1817 242.1042 138.7574 201.2848 37.4020 237.8858 131.6004 13.2904 4.8182 54.2143 21.3426 46.5037 13.1353 312.4151 7.7316 9.3531 65.9966 23.2068 19.9782 180.2288 146.1349 29.4378 16.0602 12.2767 1.5218 1.6024 0.3097 2.0424 2.0934 0.5148
temp: 298.150 k
press: 1.00000 atm
elementType: 17 9 8 8 8 8 8 7 6 6 6 6 6 6 6 6 6 6 6 6 6 6 1 1 1 1 1 1 1 1 1
symmnumber: 1
zpe: 537937.2 jmol-1
zpe.correction: 0.204889 hartree
zpe.thermalcorrener: 0.224986 hartree
zpe.thermalcorrenthalpy: 0.225931 hartree
zpe.thermalcorrgfe: 0.152551 hartree
zpe.sumelectzpe: -1527.995786 hartree
zpe.sumelectthermal: -1527.975689 hartree
zpe.sumelectthermalent: -1527.974744 hartree
zpe.sumelectthermalfe: -1528.048124 hartree
dipole: 3.4884 0.3165 -3.3478
dipole: 4.8453
quadrupole: -150.6069 -123.2147 -129.2262
quadrupole: -8.8676 0.3618 -4.7079
quadrupole: -16.2577 11.1346 5.1231 -8.8676 0.3618 -4.7079
hfenergy: -1528.200675 hartree
pointgroup: C01 [X(C14H9Cl1F1N1O5)]
dipole: 1.3625381 0.050563 1.3322331 debye
polarizability: 263.7362464|-20.9052588|175.62745|11.5959853|5.3391565|144.2159597 unknown
InChI: InChI=1S/C14H9ClFNO5/c1-21-14(18)10-7-9(3-4-12(10)17(19)20)22-13-5-2-8(16)6-11(13)15/h2-7H,1H3
charge 0 multiplicity 1
31 atoms
Cl 2.271202 1.375675 -2.261892
F  5.866741 -1.596737 0.008676
O  1.443353 1.778052 0.678691
O  -2.91842 -2.135645 0.560884
O  -1.370921 -2.447504 -1.161112
O  -4.870962 1.367404 0.03798
O  -4.243638 -0.441101 -1.206115
N  -3.981881 0.54687 -0.415605
C  -1.614015 -0.25836 -0.102842
C  0.117165 1.383695 0.420579
C  -2.571937 0.785245 -0.044987
C  -0.25637 0.054928 0.11693
C  -0.849245 2.412386 0.519396
C  -2.197425 2.108784 0.280669
C  2.507044 0.860642 0.478715
C  -1.954712 -1.706491 -0.339971
C  3.034391 0.613751 -0.8117
C  3.122543 0.288397 1.612196
C  4.160093 -0.214386 -0.981848
C  4.254465 -0.541007 1.468522
C  4.741793 -0.773428 0.170139
C  -3.420655 -3.517513 0.359436
H  0.489338 -0.742888 0.056937
H  -0.524831 3.428123 0.759195
H  -2.970117 2.880638 0.321551
H  2.707758 0.509963 2.599462
H  4.576929 -0.415807 -1.9715
H  4.747683 -0.993687 2.332195
H  -3.988623 -3.561238 -0.584614
H  -4.073056 -3.706346 1.222561
H  -2.580689 -4.230816 0.323473
