program: Gaussian 09
title: 000040065
version: EM64L-G09RevD.01
frameworkgroup: C1[X(C16H10Cl4N4O2)]
method: RPBEPBE
basis: SDD
operation: Freq
keyword: #p
keyword: freq=noraman
keyword: PBEPBE/SDD
title: #p freq=noraman PBEPBE/SDD
converged: YES YES NO NO
title: Mulliken charges:
elementType: Cl Cl Cl Cl O O N N N N C C C C C C C C C C C C C C C C H H H H H H H H H H
charge: 0.180070 0.192265 0.192233 0.180131 -0.168520 -0.168551 -0.504191 -0.486831 -0.486783 -0.504300 0.233370 0.233490 0.461858 0.461768 0.286617 0.286689 -0.383523 -0.383492 -0.331124 -0.331047 -0.246705 -0.246756 -0.237863 -0.237927 -0.228945 -0.228935 0.259762 0.259750 0.268908 0.268916 0.235033 0.235034 0.233507 0.233509 0.236293 0.236291
chargesum: 0.00000
title: Mulliken charges with hydrogens summed into heavy atoms:
elementType: Cl Cl Cl Cl O O N N N N C C C C C C C C C C C C C C C C
charge: 0.180070 0.192265 0.192233 0.180131 -0.168520 -0.168551 -0.504191 -0.486831 -0.486783 -0.504300 0.233370 0.233490 0.461858 0.461768 0.286617 0.286689 -0.123761 -0.123742 -0.062216 -0.062131 -0.011672 -0.011722 -0.004356 -0.004418 0.007348 0.007356
polarizability: 2.64585979e+02 -4.33865018e-04 2.46811719e+02 1.47624798e+00 9.86819065e-03 2.32153588e+02
1716.lowfreq: -2.5416 -0.0019 -0.0015 0.0013 7.7639 10.9002 33.0901 49.6283 57.0055
frequency: 33.0900 49.6233 56.9979 58.2069 69.3405 81.8725 84.1810 92.9811 98.1644 99.9792 113.7490 153.6018 161.6754 193.4975 206.9575 224.9252 235.2917 239.3449 255.4442 263.6959 296.1642 296.8689 312.4817 337.8045 358.6665 396.2929 407.3981 409.8692 417.5727 446.0960 467.2049 496.2782 598.5965 614.1795 614.2630 627.9423 639.5783 644.0390 669.7452 681.9247 699.5215 704.0702 723.4094 735.4617 750.9097 757.4425 805.5750 810.9086 855.5879 862.1582 889.6435 897.2334 941.9588 945.1521 988.3925 990.4018 990.6945 991.1799 1001.1688 1005.1515 1006.8340 1013.1884 1026.4557 1031.3225 1049.3744 1054.9716 1082.0652 1090.8884 1102.2738 1114.7905 1126.3413 1177.0012 1178.0495 1178.4372 1198.2455 1199.5063 1244.9514 1266.2120 1326.4200 1326.4712 1385.2358 1385.4193 1439.3842 1439.4144 1483.7845 1485.0110 1593.5890 1593.8155 1611.2262 1611.5555 1705.5450 1711.5289 3133.5738 3133.6188 3143.0615 3143.2517 3154.2539 3154.5418 3164.3275 3164.5439 3174.5882 3174.7165
redmass: 9.0916 5.3638 5.5610 5.4938 8.7277 11.4947 12.5293 11.2640 6.9982 11.4617 15.6439 21.4752 18.6513 7.9428 19.3465 8.7716 4.6784 6.1960 10.6336 10.7201 10.3008 8.9037 20.0200 14.9134 9.7224 8.1820 2.8441 3.0937 9.4487 13.0111 4.3659 3.7367 9.5360 6.4409 6.4421 12.9958 8.3073 10.0091 7.7835 10.8448 2.2037 2.1008 2.2918 9.8213 1.9334 10.0417 3.0970 4.9765 1.2473 1.2447 5.8898 7.0887 1.4949 1.5046 1.4226 4.1047 5.5384 1.5613 6.6553 1.3618 1.4323 7.0989 3.7061 2.3541 3.8811 5.8002 2.5721 3.0903 4.3428 2.9504 4.2306 2.4948 1.0529 1.4660 1.1323 1.1162 5.2554 5.7089 1.3141 1.3138 8.9263 9.2722 2.2322 2.2357 2.1906 2.2205 6.1572 6.1328 5.9748 5.9731 12.9912 12.9957 1.0853 1.0853 1.0884 1.0884 1.0930 1.0930 1.0961 1.0961 1.1005 1.1005
irintensity: 0.0131 0.1311 0.0691 1.5363 0.6022 1.0508 1.5079 0.2749 2.9161 1.3209 0.0824 0.7492 2.5299 0.1211 0.0347 16.3853 0.8903 2.7882 0.0256 0.0126 0.4356 1.0463 2.0109 1.2671 1.6364 2.3842 0.0981 0.4484 4.7519 12.6601 2.4801 3.0145 99.1228 0.0843 1.0982 36.2346 5.2531 26.5138 1.5635 22.8463 74.2400 21.2503 23.8676 12.9337 5.9825 55.9010 44.9723 5.7689 0.0360 0.9758 35.4728 73.0898 7.7504 0.4988 0.6861 1.1440 2.9867 0.1502 0.1188 0.8792 0.0886 22.2519 17.8982 10.5963 35.3292 12.4270 107.4672 6.2746 24.9974 63.1672 0.9994 54.0818 0.0215 27.6228 5.2265 11.1560 190.2847 102.4664 5.7115 0.4549 0.0093 0.0020 39.2732 2.8954 5.7975 2.5740 0.1639 0.1149 5.1002 1.3498 478.0636 268.5143 0.1764 0.0170 0.4548 8.8672 11.5492 25.8844 2.0782 25.8045 4.5803 16.3813
temp: 298.150 k
press: 1.00000 atm
elementType: 17 17 17 17 8 8 7 7 7 7 6 6 6 6 6 6 6 6 6 6 6 6 6 6 6 6 1 1 1 1 1 1 1 1 1 1
symmnumber: 1
zpe: 613872.1 jmol-1
zpe.correction: 0.233812 hartree
zpe.thermalcorrener: 0.257003 hartree
zpe.thermalcorrenthalpy: 0.257947 hartree
zpe.thermalcorrgfe: 0.180330 hartree
zpe.sumelectzpe: -2823.427471 hartree
zpe.sumelectthermal: -2823.404280 hartree
zpe.sumelectthermalent: -2823.403336 hartree
zpe.sumelectthermalfe: -2823.480953 hartree
dipole: -0.0094 7.7034 -0.0014
dipole: 7.7035
quadrupole: -164.5420 -171.3236 -184.3590
quadrupole: 0.0054 0.0283 -0.0018
quadrupole: 8.8662 2.0846 -10.9508 0.0054 0.0283 -0.0018
hfenergy: -2823.6612825 hartree
pointgroup: C01 [X(C16H10Cl4N4O2)]
dipole: -3.0307715 0.0005466 0.0005383 debye
polarizability: 246.8117486|0.0266004|264.4068223|-0.0118928|2.820732|232.332716 unknown
InChI: InChI=1S/C16H10Cl4N4O2/c17-21-13(25)23(19)16(12-9-5-2-6-10-12)15(21,11-7-3-1-4-8-11)22(18)14(26)24(16)20/h1-10H
charge 0 multiplicity 1
36 atoms
Cl 1.526372 2.407849 -2.334788
Cl 2.104018 2.951331 1.14476
Cl 2.101554 -2.952348 -1.145854
Cl 1.524456 -2.408295 2.334741
O  2.619807 -0.442188 -2.906505
O  2.620662 0.440992 2.905701
N  1.092932 0.818093 -1.54846
N  1.740328 1.199689 0.81007
N  1.739335 -1.200456 -0.810784
N  1.092708 -0.818319 1.547994
C  0.658732 0.824321 -0.144459
C  0.658267 -0.824373 0.144096
C  -0.678642 1.50439 0.077605
C  -0.679444 -1.503828 -0.077578
C  1.927702 -0.294747 -1.888451
C  1.928442 0.293831 1.887673
C  -1.061103 1.936889 1.371988
C  -1.06221 -1.936662 -1.371761
C  -1.580953 1.654074 -1.004058
C  -1.58156 -1.652907 1.004307
C  -2.327498 2.522866 1.577119
C  -2.32888 -2.522173 -1.576512
C  -2.844467 2.245113 -0.796935
C  -2.845347 -2.243491 0.797563
C  -3.221968 2.681732 0.493579
C  -3.223264 -2.680264 -0.492779
H  -0.378933 1.827145 2.221036
H  -0.380045 -1.82756 -2.220897
H  -1.288579 1.308373 -1.99995
H  -1.28879 -1.307163 2.000078
H  -2.613122 2.858478 2.579644
H  -2.614822 -2.857955 -2.578889
H  -3.533417 2.362949 -1.639915
H  -3.534157 -2.360891 1.640716
H  -4.203555 3.140852 0.654395
H  -4.205059 -3.139047 -0.653289
