program: Gaussian 09
title: 000039937
version: EM64L-G09RevD.01
frameworkgroup: C1[X(C17H15ClN2O3)]
method: RPBEPBE
basis: SDD
operation: Freq
keyword: #p
keyword: freq=noraman
keyword: PBEPBE/SDD
title: #p freq=noraman PBEPBE/SDD
converged: YES YES NO NO
title: Mulliken charges:
elementType: Cl O O O N N C C C C C C C C C C C C C C C C C H H H H H H H H H H H H H H H
charge: -0.041602 -0.408444 -0.253286 -0.437974 -0.217914 -0.021054 0.276472 0.231980 -0.376031 -0.008654 0.110020 -0.289102 -0.341451 -0.335197 0.320210 -0.324293 -0.236307 -0.142036 -0.364528 -0.378767 -0.237614 -0.229158 -0.237489 0.208034 0.288690 0.263504 0.249935 0.299028 0.213919 0.210035 0.263258 0.249140 0.279750 0.371592 0.227685 0.231242 0.231487 0.354922
chargesum: 0.00000
title: Mulliken charges with hydrogens summed into heavy atoms:
elementType: Cl O O O N N C C C C C C C C C C C C C C C C C
charge: -0.041602 -0.036852 -0.253286 -0.083052 -0.217914 -0.021054 0.276472 0.231980 0.120693 -0.008654 0.110020 -0.025598 -0.091516 -0.036169 0.320210 0.099660 0.026951 -0.142036 -0.115388 -0.099018 -0.009929 0.002083 -0.006002
polarizability: 2.63719024e+02 -2.01910585e+00 2.46683700e+02 -1.12004563e+01 1.84950863e+01 1.57147994e+02
1716.lowfreq: -5.0536 -0.0019 -0.0016 -0.0008 3.3030 8.7032 29.1861 37.4766 47.8841
frequency: 29.0773 37.4645 47.8755 54.4089 70.7188 78.1642 98.5561 108.2091 160.4989 166.5855 186.7675 198.4143 232.7719 247.8857 272.2392 281.7428 305.8858 316.2655 323.2688 348.6276 372.6957 392.1960 406.2107 407.8653 429.1426 433.7856 477.1870 492.0114 511.5091 522.9712 590.0174 607.8617 616.6479 637.5681 673.7358 676.2869 692.4758 701.4557 743.2948 778.9001 790.5235 794.3804 820.8958 848.1337 859.7151 882.0891 901.9736 923.1670 930.2788 939.1490 951.5768 962.4359 987.4448 989.5790 1003.3126 1021.3132 1027.2021 1040.6097 1073.8212 1082.0566 1085.1091 1094.3851 1126.5589 1168.4659 1172.8472 1173.3284 1187.4782 1198.8731 1212.5817 1247.0902 1267.3818 1271.1008 1284.9330 1303.7805 1318.9525 1330.3770 1365.6777 1370.9928 1383.1392 1386.0949 1400.3656 1407.7532 1435.1742 1465.6123 1470.8341 1479.2018 1481.3221 1539.3972 1568.2947 1588.0718 1592.3255 1609.9732 1612.9439 2945.6110 2979.8932 2994.0209 3003.6733 3086.4100 3126.0785 3136.2640 3148.4299 3151.3967 3159.2890 3168.7845 3170.3012 3175.6581 3473.6307 3580.1803
redmass: 5.2866 6.5962 5.5342 4.9253 5.8125 6.4738 5.1969 8.9846 5.9304 3.7289 3.6970 5.5982 1.5813 2.6592 4.5460 3.9281 5.0039 4.0610 4.3953 3.7189 3.9479 7.4230 2.9633 3.6333 1.9221 4.0417 5.7698 3.5986 5.0394 4.3769 3.2763 6.9842 6.5867 6.3852 5.4519 6.6216 6.2217 1.7092 3.5022 3.9644 3.0863 5.3993 1.5162 2.3070 1.2555 4.0342 1.5642 3.7111 2.6686 1.6043 1.3750 5.4189 1.3725 6.2029 1.3375 3.7962 2.1696 3.4546 3.0260 1.9554 1.7081 1.9468 2.1714 1.8414 1.2187 1.0540 1.1352 1.2767 1.4101 1.7767 2.4577 1.3049 2.0736 1.7091 1.4603 2.0074 1.7814 5.7578 8.4599 1.4901 2.0357 1.5340 2.2920 2.3411 1.1680 1.0833 2.3779 8.6430 8.2789 6.6420 7.1140 6.2258 8.6760 1.0550 1.0829 1.0986 1.0735 1.0967 1.0849 1.0883 1.0932 1.0886 1.0964 1.0926 1.0999 1.0970 1.0643 1.0668
irintensity: 1.5587 0.6548 0.3187 0.4658 2.0915 0.5614 8.5473 1.4515 5.9427 22.1760 14.3031 5.8322 84.3956 55.7970 6.7545 14.4861 11.0860 8.8672 17.2173 26.2477 3.2429 10.7050 1.6611 20.6284 75.5203 5.4799 2.4194 12.0459 14.9571 22.1407 5.2119 2.5249 0.1568 7.1004 28.0162 1.9964 8.5670 56.5667 6.3894 3.9577 16.5041 45.4556 31.3831 35.0330 4.4236 16.6848 9.6089 7.2057 1.9766 3.5518 1.4921 58.5439 2.7142 1.1606 2.2640 48.8496 4.9814 64.8059 233.1249 3.1597 20.6992 22.5488 12.0319 4.3343 54.4128 0.1283 11.8969 7.6442 9.5219 38.6021 70.7271 14.2717 48.2029 13.1720 15.6294 39.3578 0.9761 25.1457 0.8017 94.2238 17.1917 4.5047 12.5624 75.3323 83.0450 7.7111 5.3909 70.2918 20.6886 1.3084 40.8350 22.7745 313.7243 50.1498 14.3218 40.2664 74.6055 4.6678 1.2443 6.4407 30.5135 5.0286 17.3362 0.3101 18.7786 3.3780 28.4289 5.9219
temp: 298.150 k
press: 1.00000 atm
elementType: 17 8 8 8 7 7 6 6 6 6 6 6 6 6 6 6 6 6 6 6 6 6 6 1 1 1 1 1 1 1 1 1 1 1 1 1 1 1
symmnumber: 1
zpe: 750411.1 jmol-1
zpe.correction: 0.285817 hartree
zpe.thermalcorrener: 0.306247 hartree
zpe.thermalcorrenthalpy: 0.307191 hartree
zpe.thermalcorrgfe: 0.235739 hartree
zpe.sumelectzpe: -1450.386663 hartree
zpe.sumelectthermal: -1450.366232 hartree
zpe.sumelectthermalent: -1450.365288 hartree
zpe.sumelectthermalfe: -1450.436740 hartree
dipole: -0.5792 4.2821 5.4089
dipole: 6.9230
quadrupole: -131.3199 -148.2388 -135.3061
quadrupole: 20.8397 6.5857 0.2309
quadrupole: 6.9684 -9.9505 2.9821 20.8397 6.5857 0.2309
hfenergy: -1450.6724792 hartree
pointgroup: C01 [X(C17H15Cl1N2O3)]
dipole: 0.2307844 1.8674128 1.9692985 debye
polarizability: 261.1553058|-5.1913409|250.9924565|-12.3819486|12.8324391|155.4029557 unknown
InChI: InChI=1S/C17H15ClN2O3/c18-12-6-7-14-13(10-12)15(11-4-2-1-3-5-11)19-16(22)17(23)20(14)8-9-21/h1-7,10,16,21-22H,8-9H2
charge 0 multiplicity 1
38 atoms
Cl -0.725677 4.734102 -1.148765
O  1.355039 -2.705565 -2.612255
O  2.823622 -2.628131 -0.32689
O  1.317231 -0.787567 2.797585
N  2.265854 -0.394461 0.130149
N  -0.196152 -1.617924 -1.125361
C  1.526261 0.788023 -0.204896
C  0.122374 0.754004 -0.486958
C  3.165876 -0.384125 1.315312
C  -0.652616 -0.529816 -0.537878
C  2.165642 -1.583279 -0.596346
C  1.139662 -1.57525 -1.759694
C  2.206943 2.034798 -0.194618
C  -0.547452 1.976189 -0.771799
C  -2.019965 -0.588872 0.06329
C  2.464953 0.099958 2.588952
C  1.535516 3.238849 -0.474402
C  0.15708 3.187854 -0.766524
C  -2.40158 0.257242 1.139419
C  -2.949618 -1.549156 -0.420847
C  -3.687952 0.150803 1.711798
C  -4.234088 -1.65052 0.148624
C  -4.609955 -0.799613 1.216548
H  4.061796 0.238133 1.126484
H  3.498101 -1.427545 1.444405
H  1.272881 -0.675808 -2.394715
H  3.281441 2.059104 0.011162
H  -1.616721 1.960242 -0.999653
H  2.141639 1.157745 2.490772
H  3.195972 0.031353 3.422899
H  2.073135 4.191154 -0.479988
H  -1.687296 0.983528 1.541714
H  -2.636076 -2.207038 -1.237386
H  1.704302 -3.446593 -2.043742
H  -3.969291 0.804414 2.545052
H  -4.944101 -2.389968 -0.237853
H  -5.609787 -0.878406 1.657988
H  0.851906 -0.553659 3.638813
