program: Gaussian 09
title: 000039940
version: EM64L-G09RevD.01
frameworkgroup: C1[X(C16H12FNO3)]
method: RPBEPBE
basis: SDD
operation: Freq
keyword: #p
keyword: freq=noraman
keyword: PBEPBE/SDD
title: #p freq=noraman PBEPBE/SDD
converged: YES YES NO NO
title: Mulliken charges:
elementType: F O O O N C C C C C C C C C C C C C C C C H H H H H H H H H H H H
charge: -0.197745 -0.266099 -0.407294 -0.234337 -0.056971 -0.348780 0.549212 0.031707 -0.496544 0.232100 -0.438927 -0.359560 -0.694015 0.071396 0.327462 0.179797 -0.322532 -0.343077 -0.367421 -0.365012 0.323345 0.249662 0.290658 0.240384 0.255272 0.229780 0.245691 0.225446 0.268567 0.278768 0.260064 0.261684 0.377317
chargesum: 0.00000
title: Mulliken charges with hydrogens summed into heavy atoms:
elementType: F O O O N C C C C C C C C C C C C C C C C
charge: -0.197745 -0.266099 -0.029977 -0.234337 -0.056971 -0.099118 0.549212 0.031707 -0.205886 0.232100 -0.198543 -0.104287 0.006903 0.071396 0.327462 0.179797 -0.053965 -0.064309 -0.107357 -0.103328 0.323345
polarizability: 3.53190808e+02 1.44017452e+01 1.79563613e+02 5.18667784e+00 -1.05354632e+01 9.98190140e+01
1716.lowfreq: -10.4433 -4.8833 -2.6883 0.0002 0.0003 0.0006 25.3781 30.6142 42.9593
frequency: 25.1319 30.6065 42.9258 54.5279 61.7114 81.2129 122.7130 152.2354 197.1153 217.2741 228.0841 255.1181 261.3735 273.9463 338.5324 349.0744 388.7384 397.5837 412.4233 413.7483 438.9076 509.1671 512.0208 527.0763 569.9143 603.8270 622.4134 625.6794 627.6288 641.8019 679.7391 707.0166 734.2452 754.6154 766.2739 789.0280 806.4986 816.1130 824.4053 828.3340 847.1836 848.5836 913.5901 925.5275 948.4079 966.1905 976.3070 978.3212 1001.6429 1008.7536 1034.9626 1065.0749 1096.0539 1104.7454 1119.7331 1135.4298 1157.2114 1177.4561 1200.6524 1217.7936 1236.6988 1259.8590 1266.9787 1295.0573 1305.2863 1347.3177 1377.6622 1391.3334 1399.3434 1414.2575 1431.1945 1461.2193 1472.2530 1473.4785 1474.7739 1551.9759 1592.7681 1607.1124 1617.7080 1628.5753 1660.6963 2994.3522 3049.0235 3092.0648 3106.9602 3140.1810 3162.6436 3163.0571 3165.7605 3178.8869 3182.2092 3185.9842 3504.9619
redmass: 4.7448 7.3823 9.2837 4.5292 6.8994 7.2855 6.7718 5.3130 4.2494 1.0887 5.1571 6.0800 5.5359 6.1824 7.0497 6.0340 5.9125 5.4777 3.0670 5.0208 3.1352 4.4422 3.1313 6.2506 4.2269 3.7973 2.8813 5.3404 4.2846 2.3464 5.7158 4.4429 4.2419 4.6576 4.8195 4.5901 3.6481 2.9705 1.2492 1.8009 1.5949 12.0792 1.5581 3.0198 1.3622 1.3533 8.9716 1.3508 2.2422 2.5207 2.3364 1.6240 2.3249 1.3847 2.0859 2.3265 1.4330 2.0699 2.1446 2.8287 1.6550 1.5470 3.4677 1.2740 1.6585 1.9849 6.4988 1.1961 3.7408 3.7756 3.9483 2.3006 1.1811 2.1872 1.1849 7.4223 7.9306 7.1366 7.6066 7.5958 8.1814 1.0353 1.0852 1.1002 1.1005 1.0898 1.0934 1.0893 1.0888 1.0962 1.0971 1.0980 1.0638
irintensity: 0.0228 0.5664 2.4082 0.1892 0.1113 0.6869 0.8352 1.3645 0.8517 0.4971 1.6692 0.0632 1.5514 0.2433 5.4314 3.7285 5.2209 0.4562 0.3766 5.8516 3.2814 3.4447 32.1802 8.8866 6.9131 44.0285 47.4133 20.5239 21.4487 64.9497 26.5772 37.9072 6.4386 1.2097 10.0955 37.5908 10.7636 20.2031 0.9409 27.5500 78.0593 17.5320 16.4093 16.5629 1.3000 0.3788 69.2970 0.1683 15.0514 3.2387 274.4921 23.4540 42.5916 18.4695 8.7629 0.6546 91.0781 16.9386 37.9601 21.2819 11.7759 12.7816 4.4571 4.1036 0.1003 41.2978 2.8975 20.4314 7.8296 19.9723 24.0014 9.9624 34.3250 166.2392 47.0576 14.2922 11.7690 37.4619 29.4916 15.2852 175.9324 27.4245 6.4813 39.9926 16.6364 7.6791 0.1339 0.7844 2.7458 5.2799 2.0091 4.3575 24.6215
temp: 298.150 k
press: 1.00000 atm
elementType: 9 8 8 8 7 6 6 6 6 6 6 6 6 6 6 6 6 6 6 6 6 1 1 1 1 1 1 1 1 1 1 1 1
symmnumber: 1
zpe: 637633.7 jmol-1
zpe.correction: 0.242862 hartree
zpe.thermalcorrener: 0.260588 hartree
zpe.thermalcorrenthalpy: 0.261532 hartree
zpe.thermalcorrgfe: 0.194952 hartree
zpe.sumelectzpe: -995.715607 hartree
zpe.sumelectthermal: -995.697881 hartree
zpe.sumelectthermalent: -995.696937 hartree
zpe.sumelectthermalfe: -995.763517 hartree
dipole: 2.0534 2.5314 -0.2447
dipole: 3.2687
quadrupole: -118.7173 -115.6516 -118.6862
quadrupole: 3.4178 -1.4847 0.9492
quadrupole: -1.0322 2.0334 -1.0012 3.4178 -1.4847 0.9492
hfenergy: -995.958469 hartree
pointgroup: C01 [X(C16H12F1N1O3)]
dipole: 0.8172431 -0.9823324 0.1446196 debye
polarizability: 353.1609145|-13.7698781|177.7270128|-8.5655281|-15.2621821|101.6855076 unknown
InChI: InChI=1S/C16H12FNO3/c1-9(16(19)20)11-4-7-14-13(8-11)18-15(21-14)10-2-5-12(17)6-3-10/h2-9,19H,1H3
charge 0 multiplicity 1
33 atoms
F  -6.999513 0.69553 0.173034
O  -0.904089 -1.447919 0.213664
O  5.605897 0.63952 1.565001
O  4.725121 2.299096 0.202046
N  -0.455424 0.771427 -0.310991
C  4.594907 -0.077089 -0.513479
C  3.12664 -0.472269 -0.282275
C  0.767288 0.05629 -0.238876
C  2.094677 0.487526 -0.426517
C  0.494198 -1.304687 0.08305
C  2.818102 -1.825932 0.046184
C  1.489033 -2.27443 0.234597
C  4.864927 0.307305 -1.990895
C  -1.405521 -0.119156 -0.046141
C  -2.84991 0.071111 0.015034
C  4.960758 1.087845 0.404388
C  -3.7227 -1.012043 0.309329
C  -3.386329 1.367097 -0.22556
C  -5.115435 -0.808058 0.363429
C  -4.775794 1.582235 -0.173884
C  -5.608945 0.486225 0.11985
H  5.234073 -0.929349 -0.226776
H  2.316063 1.532846 -0.662272
H  3.638866 -2.542916 0.159887
H  1.260835 -3.313061 0.485948
H  4.568266 -0.522101 -2.655537
H  4.289462 1.20568 -2.270375
H  5.935994 0.523209 -2.153942
H  -3.305301 -2.005877 0.49305
H  -2.699968 2.188985 -0.44977
H  -5.807417 -1.62448 0.587398
H  -5.211699 2.568638 -0.354253
H  5.790936 1.417203 2.159754
