program: Gaussian 09
title: 000039851
version: EM64L-G09RevD.01
frameworkgroup: C1[X(C7H2Cl3NO2)]
method: RPBEPBE
basis: SDD
operation: Freq
keyword: #p
keyword: freq=noraman
keyword: PBEPBE/SDD
title: #p freq=noraman PBEPBE/SDD
converged: NO NO NO NO
title: Mulliken charges:
elementType: Cl Cl Cl O O N C C C C C C C H H
charge: 0.022203 0.048884 0.015425 -0.229629 -0.162811 -0.457712 0.425684 0.227610 -0.182831 -0.362296 -0.092554 -0.077609 0.174601 0.291893 0.359142
chargesum: 0.00000
title: Mulliken charges with hydrogens summed into heavy atoms:
elementType: Cl Cl Cl O O N C C C C C C C
charge: 0.022203 0.048884 0.015425 -0.229629 -0.162811 -0.098570 0.425684 0.227610 -0.182831 -0.070403 -0.092554 -0.077609 0.174601
polarizability: 1.83604490e+02 1.75267550e+00 1.28947978e+02 -2.71837735e-03 -4.40790766e-03 4.21745412e+01
1716.lowfreq: -0.0032 -0.0021 -0.0021 4.1373 4.4458 9.2764 75.5043 92.9538 146.1863
frequency: 75.5035 92.9504 146.1852 166.7300 191.7374 200.6097 213.6540 307.9549 324.9758 343.6322 363.8876 375.3963 478.3469 509.6035 579.4499 610.0990 621.5970 653.4824 679.4466 696.2373 724.6811 759.0966 808.9548 858.2697 889.6026 929.6179 1073.9754 1125.1817 1197.0942 1273.2103 1307.5073 1367.4043 1383.4666 1466.2011 1599.3439 1633.3625 1766.7333 3198.8295 3608.8172
redmass: 27.6311 13.7320 7.3947 18.5653 24.9362 26.6768 13.3411 5.8724 24.5154 16.5381 11.7899 15.1346 9.9767 5.2059 5.7342 1.1559 11.0991 13.8238 9.3625 10.3693 7.1768 10.7842 8.9692 1.4219 6.2212 9.3769 5.8684 1.8862 9.3571 2.6277 2.4363 5.3541 4.3534 6.6353 9.4906 9.6879 11.2758 1.0944 1.0811
irintensity: 0.3991 0.2397 2.8939 1.0187 0.3828 0.0461 0.2607 8.4503 0.1523 2.1781 0.0633 3.3092 1.2195 2.5017 21.4478 115.3506 1.7934 23.9318 31.9353 14.3651 4.0227 13.3313 163.6137 30.7490 25.1181 2.9522 57.6043 47.8735 21.5005 1.9027 98.3302 62.6511 44.0293 154.3727 74.3815 2.6579 875.9960 3.4616 96.6887
temp: 298.150 k
press: 1.00000 atm
elementType: 17 17 17 8 8 7 6 6 6 6 6 6 6 1 1
symmnumber: 1
zpe: 206970.9 jmol-1
zpe.correction: 0.078831 hartree
zpe.thermalcorrener: 0.089839 hartree
zpe.thermalcorrenthalpy: 0.090784 hartree
zpe.thermalcorrgfe: 0.040793 hartree
zpe.sumelectzpe: -1852.414080 hartree
zpe.sumelectthermal: -1852.403072 hartree
zpe.sumelectthermalent: -1852.402128 hartree
zpe.sumelectthermalfe: -1852.452118 hartree
dipole: -1.0220 1.5083 0.0000
dipole: 1.8219
quadrupole: -114.0584 -90.1419 -94.2685
quadrupole: 9.9319 0.0001 -0.0004
quadrupole: -14.5688 9.3477 5.2211 9.9319 0.0001 -0.0004
hfenergy: -1852.4929114 hartree
pointgroup: C01 [X(C7H2Cl3N1O2)]
dipole: 0.4373122 0.5679301 0.0000016 debye
dipolederiv: -0.0641332 0.0439533 0.0000033 -0.0344776 -0.6414535 -0.0000471 -0.0000037 -0.0000537 0.0018774 -0.523705 -0.2268859 0.0000078 -0.2717476 -0.1158541 0.000003 0.000011 0.0000042 0.011288 -0.4898752 0.3158221 0.0000181 0.3383807 -0.2967021 -0.0000155 0.0000155 -0.0000085 -0.015475 -1.4025475 0.0810176 0.0000186 0.4742402 -0.4884388 -0.0000286 0.0000161 -0.0000052 -0.1695573 -1.7917366 -0.0369968 -0.0000107 0.0365931 -0.3996084 -0.0000041 0.0000858 -0.0000011 -0.3325795 -1.3356512 -0.0216946 0.0000167 -0.2815797 -0.5015853 0.0000016 -0.0000096 -0.0000175 -0.3214105 0.720158 -0.2168225 -0.0000167 -0.646739 -0.277894 -0.0000252 -0.0000257 -0.0000268 0.1028955 0.8639945 0.0447559 -0.0000113 0.565408 0.1758629 0.000002 0.0000278 0.0000103 0.0712734 0.0015267 0.0222839 0.0000077 -0.0700257 0.9830216 0.0000908 0.0000009 0.000097 -0.0542168 -0.1594119 0.1066291 0.0000047 0.0401006 -0.0906501 0.0000021 -0.0000085 0.0000023 -0.0985204 0.5752865 0.4000326 -0.0000171 0.6638989 -0.0722973 -0.000027 -0.0000147 -0.0000295 -0.039799 0.4887698 -0.5316235 -0.00002 -0.6517677 0.4119019 0.0000257 -0.0000147 0.0000176 -0.0572477 2.8027745 0.0911394 0.000001 -0.098834 0.9956818 0.0000351 -0.000077 0.0000274 0.3365467 0.100855 -0.0113696 0.0000016 -0.0076064 0.0571437 -0.0000065 -0.0000004 -0.0000079 0.189 0.2136957 -0.060241 -0.0000036 -0.0558437 0.2608716 -0.0000063 -0.0000028 -0.0000086 0.3759253 unknown
polarizability: 183.1915476|-5.0469154|129.3609211|-0.0024462|0.0045646|42.1745412 unknown
InChI: InChI=1S/C7H2Cl3NO2/c8-2-1-3-6(5(10)4(2)9)11-7(12)13-3/h1,11H
charge 0 multiplicity 1
15 atoms
Cl 0.707251 2.971807 0.000199
Cl 3.447696 1.170694 -0.000035
Cl 3.216397 -2.069353 -0.000132
O  -2.009069 -1.290648 -0.000031
O  -4.053994 -0.072055 0.000058
N  -1.903186 0.990355 0.000066
C  -0.581874 0.523485 0.000026
C  -0.655337 -0.892169 -0.000034
C  0.660679 1.168176 0.000053
C  0.4758 -1.706542 -0.000077
C  1.834394 0.370404 -0.000013
C  1.727542 -1.045064 -0.000081
C  -2.820269 -0.076887 -0.000001
H  0.409259 -2.795893 -0.000126
H  -2.199489 1.96499 0.000128
