program: Gaussian 09
title: 000039884
version: EM64L-G09RevD.01
frameworkgroup: C1[X(C19H22FN3O2)]
method: RPBEPBE
basis: SDD
operation: Freq
keyword: #p
keyword: freq=noraman
keyword: PBEPBE/SDD
title: #p freq=noraman PBEPBE/SDD
converged: YES YES NO NO
title: Mulliken charges:
elementType: F O O N N N C C C C C C C C C C C C C C C C C C C H H H H H H H H H H H H H H H H H H H H H H
charge: -0.190087 -0.461667 -0.245521 -0.085544 -0.147260 -0.108111 -0.351560 -0.355555 -0.400758 -0.376822 -0.347760 -0.406715 -0.159261 0.247390 0.044166 -0.323098 0.340968 -0.181184 -0.347142 -0.220185 -0.326364 -0.326703 -0.386011 -0.367185 0.334612 0.197231 0.204092 0.210371 0.185662 0.207813 0.273077 0.198985 0.217805 0.210671 0.211017 0.237679 0.224511 0.235255 0.214770 0.366346 0.228311 0.231191 0.227033 0.248614 0.285325 0.265296 0.266299
chargesum: 0.00000
title: Mulliken charges with hydrogens summed into heavy atoms:
elementType: F O O N N N C C C C C C C C C C C C C C C C C C C
charge: -0.190087 -0.095321 -0.245521 -0.085544 -0.147260 -0.108111 0.049763 0.040478 0.080132 0.039968 0.073929 0.055474 0.075994 0.247390 0.044166 -0.108328 0.340968 0.047128 -0.115951 0.006848 -0.077750 -0.041378 -0.120715 -0.100886 0.334612
polarizability: 3.08290085e+02 3.14188929e+01 2.11246821e+02 1.12294582e+00 -1.23164437e+01 1.92878195e+02
1716.lowfreq: -15.7383 -8.3593 -3.3494 -0.0006 0.0004 0.0006 4.7776 11.5103 17.3531
frequency: -12.5330 11.2925 16.9530 43.1732 48.2203 53.7864 73.6867 84.8820 106.0677 131.6513 136.7790 145.3018 175.8423 207.7276 247.0725 251.6310 281.3828 296.1033 307.6869 317.6585 345.7272 370.6864 379.5193 408.8225 410.1247 413.2660 454.3841 460.2815 470.7259 472.9668 481.7558 509.2074 512.5935 561.2789 587.3320 610.6711 623.8149 627.7820 679.0200 726.2189 730.1156 733.5958 758.5508 767.9058 775.5702 795.1584 814.2759 826.6897 840.6021 845.6647 859.0748 889.3728 928.3107 940.1853 942.8766 952.2514 957.8211 974.8072 976.0272 988.1131 1002.0477 1005.1263 1011.4756 1042.1811 1050.5105 1056.6416 1073.3628 1083.7893 1093.6001 1104.5748 1109.4125 1135.1054 1141.3780 1158.2104 1169.7746 1177.6877 1199.5609 1202.4612 1208.2808 1224.8366 1241.9000 1250.2675 1262.2236 1275.4476 1288.8734 1295.1234 1301.1408 1303.1233 1326.3766 1330.1402 1338.0823 1350.9595 1364.6803 1366.0057 1372.0587 1388.6931 1391.0220 1397.1765 1414.1724 1424.8483 1448.6597 1454.3530 1457.2251 1463.9250 1468.4021 1480.5450 1486.0113 1492.8308 1551.2580 1552.4088 1596.2798 1598.2386 1609.0743 2854.2901 2869.4216 2890.8927 2944.6390 2950.8566 2981.0844 3008.6769 3011.1892 3029.4214 3051.9632 3072.8407 3086.9949 3096.7776 3117.6567 3133.9156 3159.0327 3159.9925 3164.4232 3176.2520 3180.4897 3183.5242 3404.3311
redmass: 3.9130 6.7889 5.5286 5.1479 4.6173 3.4105 3.8554 6.1209 7.7338 5.4805 6.0602 3.7289 3.4134 2.9205 3.1371 2.4979 5.9314 3.3348 3.4687 5.2938 4.1941 3.5583 6.3316 3.3898 2.3799 2.6795 3.9960 1.8030 3.1376 2.7791 2.7109 2.7966 2.4413 4.9341 6.6545 4.2036 7.1014 2.7513 4.0414 1.7099 4.4161 4.4334 3.0519 2.4312 1.5058 5.1502 2.0850 1.5261 1.5622 1.4026 1.8363 3.4549 3.9733 2.3433 1.4225 4.1013 1.4515 3.5920 1.3214 1.3591 2.5045 2.5322 2.5401 2.4664 1.7847 2.1248 2.7121 2.4486 1.6917 2.2047 1.4345 2.4416 2.6934 1.4188 1.1504 1.7003 1.1455 1.5803 1.9776 1.5818 1.5873 1.5270 1.6085 1.8481 1.2843 1.3036 1.9930 1.2666 1.2841 1.8317 1.6396 1.4730 1.3783 1.6515 1.7290 2.3532 2.1333 1.4705 3.7107 2.1580 1.0915 1.1117 1.0887 1.1095 1.1612 1.1019 2.7077 2.6257 5.2562 8.5602 7.6685 6.0696 6.4921 1.0705 1.0704 1.0676 1.0696 1.0696 1.0814 1.0872 1.0641 1.0892 1.0893 1.1024 1.0906 1.0918 1.0893 1.0885 1.0888 1.0892 1.0924 1.1001 1.0966 1.0975 1.0640
irintensity: 0.5692 0.0892 0.1521 0.0139 0.0576 0.5734 0.5795 0.8889 1.4015 4.1306 3.9290 2.6749 0.6230 7.0076 1.2515 1.2809 0.9076 10.8483 10.9310 18.3690 11.8182 3.4855 8.0063 3.9001 0.5601 0.2994 5.3222 94.1226 27.8039 3.6844 35.1253 8.4809 1.7787 19.2841 21.3429 6.2205 0.9008 8.7939 21.0054 31.1560 1.4088 7.2234 8.7108 63.8213 7.9548 8.9241 29.3100 1.4538 0.3036 0.0744 52.9826 15.0869 12.9398 7.2700 0.4536 51.2866 14.4019 83.6336 0.1161 2.2716 51.7981 2.5613 81.8860 7.6843 3.7552 5.2810 42.7232 7.2923 0.2458 24.4429 10.4762 59.7433 51.5986 69.1323 4.6052 3.8347 0.9687 15.6529 12.2829 21.7489 16.2605 205.6651 43.4631 172.2473 53.0448 7.1988 17.7890 11.2920 9.2487 16.5652 12.1925 19.7121 40.9255 25.7661 13.7390 9.3781 0.7473 3.3160 10.6438 31.0454 9.4162 50.3213 2.8991 40.9718 57.3759 3.9651 198.1489 47.6553 43.3743 106.6718 37.5183 396.4318 91.3543 55.6389 65.6622 76.9290 42.0295 95.8575 36.8024 16.9330 24.0062 52.7325 48.7184 40.7649 22.2633 10.3649 31.7917 11.9746 5.6049 0.0461 34.3904 15.6584 2.2453 2.5221 42.4706
temp: 298.150 k
press: 1.00000 atm
elementType: 9 8 8 7 7 7 6 6 6 6 6 6 6 6 6 6 6 6 6 6 6 6 6 6 6 1 1 1 1 1 1 1 1 1 1 1 1 1 1 1 1 1 1 1 1 1 1
symmnumber: 1
zpe: 995653.4 jmol-1
zpe.correction: 0.379224 hartree
zpe.thermalcorrener: 0.401141 hartree
zpe.thermalcorrenthalpy: 0.402085 hartree
zpe.thermalcorrgfe: 0.325338 hartree
zpe.sumelectzpe: -1149.895873 hartree
zpe.sumelectthermal: -1149.873957 hartree
zpe.sumelectthermalent: -1149.873013 hartree
zpe.sumelectthermalfe: -1149.949759 hartree
dipole: -1.5461 -2.9138 0.1997
dipole: 3.3046
quadrupole: -149.1348 -160.0495 -140.9670
quadrupole: -2.2163 9.0420 -8.5438
quadrupole: 0.9156 -9.9991 9.0834 -2.2163 9.0420 -8.5438
hfenergy: -1150.2750976 hartree
pointgroup: C01 [X(C19H22F1N3O2)]
dipole: -0.5672128 -1.0617445 0.4912521 debye
polarizability: 306.0311293|32.2844962|202.5724225|-12.1903246|-16.4107862|203.8115499 unknown
InChI: InChI=1S/C19H22FN3O2/c20-16-6-4-15(5-7-16)19(25)17(24)8-10-22-11-13-23(14-12-22)18-3-1-2-9-21-18/h1-7,9,17,24H,8,10-14H2
charge 0 multiplicity 1
47 atoms
F  -6.404303 -3.324813 0.635979
O  -2.404606 3.375698 -1.047453
O  -3.606088 2.428765 1.103861
N  0.704954 0.419561 -0.187111
N  3.518907 -0.227077 -0.088387
N  5.627432 0.24782 -1.021871
C  1.670292 1.073086 -1.111703
C  1.375779 0.132801 1.104074
C  2.877256 0.15563 -1.363748
C  2.589007 -0.798666 0.897748
C  -0.548777 1.196503 -0.004101
C  -1.470106 1.098643 -1.236969
C  -2.759041 1.965071 -1.105928
C  4.908481 -0.279615 0.028649
C  -3.580944 1.591747 0.145334
C  5.577203 -0.835061 1.170869
C  -4.30146 0.290581 0.23502
C  6.981641 -0.808331 1.216395
C  6.984869 0.255951 -0.949643
C  7.720425 -0.249998 0.143123
C  -4.454497 -0.579447 -0.880596
C  -4.877187 -0.074411 1.48526
C  -5.160287 -1.792241 -0.754032
C  -5.579867 -1.283282 1.631492
C  -5.70281 -2.116356 0.502709
H  2.026784 2.049812 -0.697079
H  1.174036 1.276377 -2.076672
H  0.654175 -0.366124 1.77793
H  1.725886 1.071487 1.605562
H  2.527809 -0.758046 -1.891345
H  3.638338 0.652891 -1.983639
H  3.090814 -0.934967 1.868397
H  2.224545 -1.790333 0.551363
H  -0.345616 2.272358 0.218508
H  -1.071261 0.774883 0.876782
H  -0.947628 1.469646 -2.136877
H  -1.725451 0.037447 -1.412892
H  -3.379309 1.816862 -2.012572
H  5.023027 -1.286648 1.997297
H  -2.632506 3.688702 -0.124507
H  7.499667 -1.230047 2.085237
H  7.497054 0.690058 -1.817281
H  8.813249 -0.217279 0.148885
H  -4.039206 -0.311865 -1.856619
H  -4.760169 0.613028 2.328788
H  -5.294095 -2.473115 -1.598939
H  -6.026216 -1.582584 2.583803
