program: Gaussian 09
title: 000039870
version: EM64L-G09RevD.01
frameworkgroup: C1[X(C15H14O3)]
method: RPBEPBE
basis: SDD
operation: Freq
keyword: #pfreq=noraman
keyword: PBEPBE/SDD
title: #p freq=noraman PBEPBE/SDD
converged: YES YES NO NO
title: Mulliken charges:
elementType: O O O C C C C C C C C C C C C C C C H H H H H H H H H H H H H H
charge: -0.272082 -0.405019 -0.241415 0.406415 0.495320 -0.636667 0.317471 -0.552808 -0.524371 0.349075 -0.627028 -0.387759 -0.386727 -0.240661 -0.238850 0.208091 -0.240644 -0.537597 0.245643 0.265402 0.278376 0.244864 0.247456 0.239543 0.241135 0.225328 0.225818 0.229326 0.229502 0.222243 0.243557 0.377065
chargesum: 0.00000
title: Mulliken charges with hydrogens summed into heavy atoms:
elementType: O O O C C C C C C C C C C C C C C C
charge: -0.272082 -0.027954 -0.241415 0.406415 0.495320 -0.391023 0.317471 -0.287406 -0.245995 0.349075 -0.134707 -0.148217 -0.145592 -0.015333 -0.013033 0.208091 -0.011319 0.157704
polarizability: 2.56582354e+02 1.75324813e+01 1.86942638e+02 2.30604062e+00 4.20514453e+00 9.13299596e+01
1716.lowfreq: -6.9276 -4.1925 -0.0008 0.0002 0.0006 3.0262 19.6913 32.4378 51.1917
frequency: 19.6628 32.3968 51.1174 60.9958 92.5678 94.9585 115.0983 177.3095 192.4959 227.8363 245.1850 262.8830 273.4122 307.8156 373.7738 396.0269 407.2081 447.5338 480.1978 515.6978 540.9048 557.3450 572.0214 609.1314 618.9192 630.9236 653.5783 700.1494 703.6772 732.7245 771.4019 828.3259 840.0309 851.6003 875.8367 890.6083 890.7204 921.0464 931.1416 941.4436 974.2360 981.2807 990.4913 994.3973 1018.2824 1031.4962 1060.6838 1081.0748 1085.6689 1111.6483 1156.7784 1166.6392 1173.8765 1182.1685 1194.9391 1210.5807 1266.8740 1287.5248 1315.5938 1323.4176 1330.5850 1373.4804 1388.3462 1425.7452 1435.3479 1448.6960 1456.2640 1459.6642 1465.6330 1474.7708 1496.3820 1582.3115 1597.2338 1613.4845 1616.1872 1658.3762 2962.8773 3013.0077 3052.0419 3104.0463 3122.6951 3126.5557 3127.8901 3139.3110 3142.0826 3149.2503 3160.5200 3162.5647 3165.0773 3506.1777
redmass: 5.9699 8.5782 3.8107 4.3764 4.2441 5.7143 4.0611 3.0505 1.9908 3.8702 3.8583 1.9460 4.5805 4.6301 4.4129 2.7710 2.8646 4.0509 3.3828 4.5013 4.2909 3.7361 3.6111 4.4851 5.2264 3.8573 1.7249 1.8553 1.9951 4.1079 1.8768 4.7487 2.7477 1.2551 1.4430 1.6900 2.1915 1.6810 3.9932 2.0861 1.5023 5.1350 5.0457 1.3186 4.5534 2.4528 1.9397 1.9050 1.5993 1.2607 1.3998 1.6508 1.0643 1.2187 1.1751 1.8962 1.3763 1.3194 1.4949 3.9364 2.0706 5.0215 5.4141 2.7878 1.3700 1.3785 2.3160 1.5720 1.0507 1.1522 2.7478 5.3649 6.0418 6.1185 6.7070 8.4844 1.0328 1.0634 1.1041 1.0984 1.0843 1.0998 1.0873 1.0916 1.0916 1.0962 1.0914 1.0925 1.1008 1.0638
irintensity: 0.4816 2.7096 0.2011 3.5800 1.8519 2.1895 1.2499 0.9271 0.8707 0.0060 1.1068 0.7273 1.9467 0.7475 0.1661 6.0587 0.2999 3.1474 6.4613 13.4150 22.6519 10.0777 33.2690 2.1352 1.5675 41.7339 123.9728 3.7155 62.2098 13.8164 68.6641 3.6192 44.1208 0.6513 1.0382 27.7176 3.9432 6.8917 12.7694 21.0807 1.1424 1.6263 0.8953 0.2685 52.4283 5.1338 209.8666 44.1034 4.1039 0.2344 2.3583 64.1595 1.9127 38.9938 1.8292 46.2551 0.2508 10.3269 0.7063 66.4361 75.3242 4.2480 35.1907 29.8544 3.6791 17.7640 42.8228 23.6550 14.4165 33.3204 10.0389 41.8768 69.3544 22.1184 106.0688 199.9332 61.9885 12.2330 43.8111 4.7293 5.3744 26.3165 0.6022 13.9329 8.8373 40.1425 0.3671 3.6431 24.5473 22.7670
temp: 298.150 k
press: 1.00000 atm
elementType: 8 8 8 6 6 6 6 6 6 6 6 6 6 6 6 6 6 6 1 1 1 1 1 1 1 1 1 1 1 1 1 1
symmnumber: 1
zpe: 659142.1 jmol-1
zpe.correction: 0.251054 hartree
zpe.thermalcorrener: 0.267326 hartree
zpe.thermalcorrenthalpy: 0.268270 hartree
zpe.thermalcorrgfe: 0.205016 hartree
zpe.sumelectzpe: -804.388342 hartree
zpe.sumelectthermal: -804.372070 hartree
zpe.sumelectthermalent: -804.371126 hartree
zpe.sumelectthermalfe: -804.434380 hartree
dipole: 0.4918 -0.7835 0.2309
dipole: 0.9534
quadrupole: -95.6342 -93.9156 -105.6537
quadrupole: 1.3031 -0.9226 3.2593
quadrupole: 2.7669 4.4856 -7.2525 1.3031 -0.9226 3.2593
hfenergy: -804.6393957 hartree
pointgroup: C01 [X(C15H14O3)]
dipole: 0.2018309 -0.3116553 0.0531654 debye
polarizability: 255.8539006|19.1097141|185.7974401|0.2348095|13.8690419|93.2036103 unknown
InChI: InChI=1S/C15H14O3/c1-18-14-8-11(9-15(16)17)7-13(10-14)12-5-3-2-4-6-12/h2-8,10,16H,9H2,1H3
charge 0 multiplicity 1
32 atoms
O  1.399911 3.228223 -0.039028
O  3.508416 -2.796043 -1.071782
O  4.622284 -0.8586 -0.444387
C  -0.734273 0.22467 0.187336
C  1.603532 -0.479964 0.529433
C  0.232874 -0.793166 0.432415
C  -2.185035 -0.110841 0.082277
C  -0.29062 1.558687 0.042514
C  2.043232 0.860181 0.381145
C  1.086498 1.872089 0.137376
C  2.621741 -1.587047 0.822672
C  -2.610054 -1.355147 -0.460385
C  -3.181962 0.803918 0.520943
C  -3.981049 -1.674332 -0.56005
C  -4.553358 0.48766 0.419734
C  3.688748 -1.670766 -0.257066
C  -4.961069 -0.754182 -0.120785
C  2.814343 3.609297 0.018733
H  -0.095198 -1.828278 0.576088
H  -0.989635 2.369957 -0.18181
H  3.11287 1.082269 0.440326
H  2.115294 -2.560226 0.908946
H  3.141488 -1.373448 1.77528
H  -1.863232 -2.064417 -0.835072
H  -2.879587 1.756741 0.970012
H  -4.284903 -2.635602 -0.989646
H  -5.303175 1.205427 0.771165
H  -6.02577 -1.000745 -0.198472
H  3.402706 3.092768 -0.763906
H  3.249651 3.390146 1.012986
H  2.826142 4.694276 -0.160814
H  4.204191 -2.800703 -1.785075
