program: Gaussian 09
title: 000039847
version: EM64L-G09RevD.01
frameworkgroup: C1[X(C16H23NO5)]
method: RPBEPBE
basis: SDD
operation: Freq
keyword: #p
keyword: freq=noraman
keyword: PBEPBE/SDD
title: #p freq=noraman PBEPBE/SDD
converged: YES YES NO NO
title: Mulliken charges:
elementType: O O O O O N C C C C C C C C C C C C C C C C H H H H H H H H H H H H H H H H H H H H H H H
charge: -0.254373 -0.240407 -0.274820 -0.257325 -0.291237 -0.212956 -0.355113 -0.243974 -0.329760 0.127910 0.345646 -0.468456 -0.563882 0.251139 0.249663 0.033602 -0.239399 -0.237406 -0.231839 -0.676517 -0.686654 -0.687071 0.257175 0.221936 0.243344 0.248789 0.236099 0.210260 0.254448 0.290104 0.217391 0.206366 0.199250 0.215649 0.234906 0.197021 0.201203 0.233914 0.230386 0.228633 0.235701 0.206213 0.238186 0.226461 0.209795
chargesum: 0.00000
title: Mulliken charges with hydrogens summed into heavy atoms:
elementType: O O O O O N C C C C C C C C C C C C C C C C
charge: -0.254373 -0.240407 -0.274820 -0.257325 -0.291237 -0.212956 0.123997 0.248159 0.116599 0.127910 0.345646 -0.214008 -0.273778 0.251139 0.249663 0.033602 0.184359 0.177493 0.200088 -0.011014 -0.016107 -0.012629
polarizability: 2.67880880e+02 -1.48754989e+00 2.37708901e+02 8.18848221e+00 7.39782227e+00 1.34037089e+02
1716.lowfreq: -8.2252 -0.0008 -0.0005 -0.0003 2.3674 7.7561 20.2714 31.4323 43.5476
frequency: 20.0408 31.4117 43.5125 52.4971 57.9725 69.0003 78.0984 90.2899 93.3853 99.9857 108.4789 112.4500 136.7764 165.4101 193.2616 220.5339 230.6780 240.6969 243.8807 246.5308 247.8714 258.5966 276.9635 285.2772 297.2619 310.5905 327.1199 369.5847 412.9146 429.5946 530.7545 548.3731 571.8957 586.6978 591.3292 630.4836 663.8668 706.6387 723.9710 730.1695 778.9436 810.6615 815.6367 818.6280 824.0882 825.0527 843.4715 861.2956 874.4402 879.8413 893.7589 904.4244 955.6829 990.1135 1006.7914 1022.8972 1032.1139 1036.0828 1070.8604 1076.9511 1094.1100 1113.3349 1115.1803 1117.2891 1119.0473 1131.0670 1134.0307 1134.7592 1135.0102 1164.9685 1182.8988 1203.7371 1213.0578 1230.0303 1253.3013 1260.2095 1263.1717 1286.6923 1301.7679 1322.2854 1349.4955 1354.1125 1354.9142 1366.6966 1386.3513 1390.6533 1394.3216 1399.8195 1401.7344 1414.3089 1457.5447 1460.3163 1461.4002 1471.8182 1474.4837 1475.0319 1477.1203 1481.7524 1484.5363 1488.9110 1490.2375 1491.8442 1495.2073 1534.3474 1587.2813 1589.3656 2951.8018 2958.4506 2971.9868 2977.5042 2982.7229 2985.4080 2993.9071 2996.7910 2997.1326 3012.3290 3018.6943 3054.8345 3080.6927 3083.0881 3090.4183 3094.0076 3094.1907 3105.9213 3106.4256 3106.8738 3107.9401 3173.7110 3176.4254
redmass: 4.5222 3.5119 3.6288 2.9582 3.7150 2.7602 2.8962 3.3521 3.4930 3.3305 1.8099 1.9482 4.5035 4.6107 4.3121 3.7694 2.2907 1.5905 1.5731 2.0689 1.3448 3.0450 3.0815 2.5628 5.0037 4.7762 4.9334 4.3319 5.6555 5.4344 5.7841 6.2012 5.7327 4.6826 5.4853 2.9899 5.0054 5.4837 4.4934 3.6931 4.1540 3.2951 1.1039 1.2548 3.0886 1.2183 1.3497 3.5566 2.9466 2.1660 2.9391 2.1865 2.3297 4.8895 2.4738 2.6445 4.1879 2.8475 1.5987 7.2444 1.7032 2.2296 2.1070 2.3076 2.5155 1.4171 1.4313 1.4317 1.4394 2.1967 1.3967 1.9380 1.5684 1.6096 1.1660 1.1488 1.1402 3.9660 1.2474 1.2931 1.3854 1.4903 1.4931 1.5680 2.5110 2.0459 1.3603 1.3834 1.6814 3.7837 1.0406 1.0400 1.0401 1.2361 1.1240 1.1451 1.0699 1.0756 1.5918 1.1039 1.1213 1.1240 1.2516 8.9286 8.1650 5.9734 1.0559 1.0557 1.0690 1.0606 1.0643 1.0638 1.0367 1.0362 1.0363 1.1067 1.1072 1.1020 1.0987 1.1021 1.0984 1.0989 1.0990 1.1017 1.1013 1.1013 1.0999 1.0899 1.0910
irintensity: 0.9875 1.6820 0.5281 0.0709 0.9095 7.1718 1.2946 10.9169 0.7339 3.4655 0.3637 2.9716 0.1214 1.1463 0.4916 3.3859 10.3834 1.0397 0.7135 5.0341 1.2703 3.4032 3.7098 1.5997 7.1843 1.7884 5.8322 0.2742 7.3283 2.0354 4.5180 2.2180 9.5682 0.9460 6.8030 4.8539 12.4378 35.6414 10.4716 30.2811 8.0818 2.6516 4.2109 2.7560 1.8066 15.5076 4.8806 15.9698 44.5063 12.3258 6.9548 52.5288 1.2843 12.6696 4.2300 82.1257 18.5227 7.6897 13.8078 497.6784 4.6292 9.8087 15.0190 53.4783 21.6772 28.4516 19.6846 3.8374 4.5667 163.7068 4.2773 30.9264 21.1663 83.7699 10.8558 0.2008 0.0627 97.4372 1.5035 15.2974 51.1501 71.6767 97.5980 106.8366 380.8210 4.8693 12.3137 1.5825 49.2325 174.8966 9.2648 11.6774 12.9009 16.0727 6.6568 1.8016 30.3195 3.0511 59.8692 5.4001 1.1444 6.2050 5.9127 293.9153 71.7460 9.8358 43.3890 36.1495 52.4327 46.7479 43.2051 42.2971 30.8779 31.8462 18.4164 32.6222 30.4957 13.0790 14.5867 23.5748 33.9357 27.0900 30.5836 29.6447 33.5700 35.1242 32.1281 9.1615 0.7671
temp: 298.150 k
press: 1.00000 atm
elementType: 8 8 8 8 8 7 6 6 6 6 6 6 6 6 6 6 6 6 6 6 6 6 1 1 1 1 1 1 1 1 1 1 1 1 1 1 1 1 1 1 1 1 1 1 1
symmnumber: 1
zpe: 968899.8 jmol-1
zpe.correction: 0.369034 hartree
zpe.thermalcorrener: 0.392840 hartree
zpe.thermalcorrenthalpy: 0.393784 hartree
zpe.thermalcorrgfe: 0.313642 hartree
zpe.sumelectzpe: -1052.627310 hartree
zpe.sumelectthermal: -1052.603505 hartree
zpe.sumelectthermalent: -1052.602561 hartree
zpe.sumelectthermalfe: -1052.682703 hartree
dipole: 0.5316 3.4579 3.4140
dipole: 4.8882
quadrupole: -144.6883 -112.8602 -129.1155
quadrupole: -9.5254 -2.6794 -3.5962
quadrupole: -15.8003 16.0278 -0.2275 -9.5254 -2.6794 -3.5962
hfenergy: -1052.9963449 hartree
pointgroup: C01 [X(C16H23N1O5)]
dipole: 0.4424417 -0.9596869 -1.6068228 debye
polarizability: 265.8255905|9.6291979|231.7019668|-9.9140586|27.8956229|142.0993118 unknown
InChI: InChI=1S/C16H23NO5/c1-4-20-13-9-12(16(18)17-7-8-19-11-17)10-14(21-5-2)15(13)22-6-3/h9-10H,4-8,11H2,1-3H3
charge 0 multiplicity 1
45 atoms
O  -5.380649 -0.929259 -0.939211
O  2.134382 2.67612 0.201227
O  1.842799 -2.048911 -0.471829
O  3.325299 0.305023 -0.235012
O  -2.822122 1.491534 1.212156
N  -3.255992 -0.272443 -0.206627
C  -3.067376 -1.0914 -1.430928
C  -4.715443 -0.092582 0.060691
C  -4.458761 -0.969844 -2.093677
C  -2.368102 0.595562 0.421664
C  -0.893837 0.452109 0.16848
C  -0.272576 -0.791147 -0.100822
C  -0.112908 1.623575 0.295578
C  1.287918 1.567997 0.117656
C  1.132533 -0.854712 -0.25236
C  1.930243 0.323983 -0.166772
C  1.527325 3.967359 0.591338
C  1.089646 -3.317683 -0.419993
C  3.946722 -0.189451 -1.497615
C  5.454259 -0.035674 -1.319055
C  2.668076 4.977469 0.671158
C  2.106278 -4.441628 -0.602706
H  -2.252446 -0.69281 -2.056913
H  -2.851602 -2.148134 -1.182721
H  -4.981015 0.978689 -0.040325
H  -5.009481 -0.45994 1.056728
H  -4.742661 -1.837516 -2.707753
H  -4.538027 -0.036438 -2.688415
H  -0.869368 -1.705307 -0.125329
H  -0.62923 2.552202 0.550255
H  1.017463 3.852552 1.569214
H  0.774177 4.266386 -0.166527
H  0.327775 -3.331304 -1.227387
H  0.573014 -3.397286 0.55812
H  3.653977 -1.242293 -1.658489
H  3.571075 0.429811 -2.337038
H  5.982539 -0.376793 -2.228563
H  5.717702 1.018994 -1.130537
H  5.803847 -0.639015 -0.463739
H  3.173561 5.073178 -0.304985
H  3.41502 4.66003 1.418169
H  2.276025 5.968825 0.962937
H  2.867558 -4.408229 0.194778
H  2.61781 -4.353661 -1.57656
H  1.597972 -5.422139 -0.562262
