program: Gaussian 09
title: 000039810
version: EM64L-G09RevD.01
frameworkgroup: C1[X(C16H13ClO4)]
method: RPBEPBE
basis: SDD
operation: Freq
keyword: #p
keyword: freq=noraman
keyword: PBEPBE/SDD
title: #p freq=noraman PBEPBE/SDD
converged: YES YES NO NO
title: Mulliken charges:
elementType: Cl O O O O C C C C C C C C C C C C C C C C H H H H H H H H H H H H H
charge: -0.051574 -0.288554 -0.288470 -0.413776 -0.230069 0.080951 -0.419851 0.446116 -0.475698 0.212589 0.213429 -0.370173 -0.369777 -0.363017 -0.363215 0.170687 -0.203055 -0.203154 -0.213550 -0.213494 -0.110874 0.250590 0.252064 0.280542 0.280507 0.267071 0.267040 0.251621 0.251579 0.256928 0.256942 0.230439 0.230432 0.378777
chargesum: 0.00000
title: Mulliken charges with hydrogens summed into heavy atoms:
elementType: Cl O O O O C C C C C C C C C C C C C C C C
charge: -0.051574 -0.288554 -0.288470 -0.035000 -0.230069 0.080951 0.082803 0.446116 0.085351 0.212589 0.213429 -0.103102 -0.102737 -0.111396 -0.111636 0.170687 0.053873 0.053788 0.016889 0.016937 -0.110874
polarizability: 2.19580075e+02 -2.85358677e+01 1.86086403e+02 2.06374184e-01 -2.68287413e-01 1.61115023e+02
1716.lowfreq: -9.1251 -3.5306 -0.0019 -0.0007 0.0005 3.7629 9.2868 18.9777 24.4892
frequency: 4.1254 18.8637 24.4880 36.5514 45.1169 97.3104 106.3183 107.4358 183.2978 185.9789 190.7737 216.7424 254.2228 296.4911 296.9971 333.4513 362.0024 406.3066 415.4777 429.6395 471.0673 480.3067 505.8846 518.4103 545.3741 550.4164 573.5768 598.3703 623.6813 639.6662 658.9511 680.2596 706.5477 726.3559 730.1944 742.1095 746.2723 791.6672 818.0558 833.9348 835.0725 844.7856 850.1053 870.0675 918.6353 941.1830 960.1074 963.0565 974.3908 1004.3980 1007.8297 1032.9898 1037.2729 1072.1459 1091.4651 1096.6819 1110.1648 1141.0503 1156.8485 1163.5687 1182.5277 1186.7732 1220.0934 1232.4203 1247.6591 1272.4820 1283.6617 1292.8047 1318.7196 1370.9861 1384.7174 1390.1313 1409.7358 1443.9615 1444.9760 1451.9634 1463.7033 1474.3427 1585.6210 1599.4804 1606.4867 1628.4800 1665.2006 3012.2378 3024.5574 3061.8073 3086.2540 3142.2948 3155.5107 3155.6614 3159.6014 3174.5469 3175.4902 3178.0847 3183.0255 3512.9020
redmass: 4.2957 9.1853 7.2353 9.8787 5.4040 3.8789 2.4025 7.9369 6.4550 3.9051 8.9073 7.7992 3.7559 8.4245 6.6419 7.3874 5.2610 2.9304 3.0627 5.8424 6.0533 4.2593 1.8624 4.2171 4.0047 4.2395 6.0182 7.1043 7.1400 1.3470 4.8881 8.6135 4.6272 3.6347 7.3443 2.2690 1.2561 6.2805 3.1679 1.5247 1.3268 1.9433 1.8411 4.4674 1.3819 5.6104 1.3711 1.2891 1.3618 3.9039 2.0568 2.6140 2.8920 2.7404 1.9745 2.6686 1.3410 1.8555 4.5686 1.1319 1.1178 1.4611 2.4236 3.3340 1.7636 1.4212 1.1201 1.2484 2.0351 6.1710 1.9001 3.6126 5.3028 1.0812 2.4551 1.0974 3.4033 2.4116 7.9238 6.2390 7.9412 7.9952 8.0800 1.0611 1.0604 1.0987 1.1014 1.0860 1.0885 1.0886 1.0917 1.0963 1.0953 1.0975 1.0995 1.0640
irintensity: 0.2443 0.9510 0.2371 0.0095 0.0007 0.0295 0.4356 3.4198 3.5287 0.2782 0.1753 1.2868 3.4370 0.4592 0.0398 2.2595 0.2670 0.0001 7.9555 39.0874 1.2113 12.2591 28.7113 4.0094 62.7413 0.0368 15.4842 0.0005 0.7838 124.4488 4.9090 14.6991 0.3690 3.6677 16.3381 0.1240 107.1639 51.7998 9.9929 55.3462 1.1590 9.0781 14.3181 45.9939 5.1355 85.2605 11.5723 0.0059 0.2735 51.6917 18.9120 14.3786 271.9586 43.5092 14.3206 35.1579 2.2419 2.0987 195.1995 39.2779 9.8474 0.5338 11.5014 223.0540 15.5514 1.0715 1.1036 1.0230 177.8849 0.6368 21.6768 8.7359 3.7916 5.9747 3.2294 50.4486 223.9312 43.5479 1.3504 31.3990 0.7134 3.7248 199.5555 6.8478 15.0817 0.0180 5.0703 2.1277 0.1147 1.8815 17.7423 3.3777 9.2194 0.8778 6.5695 23.9272
temp: 298.150 k
press: 1.00000 atm
elementType: 17 8 8 8 8 6 6 6 6 6 6 6 6 6 6 6 6 6 6 6 6 1 1 1 1 1 1 1 1 1 1 1 1 1
symmnumber: 1
zpe: 659162.8 jmol-1
zpe.correction: 0.251062 hartree
zpe.thermalcorrener: 0.269616 hartree
zpe.thermalcorrenthalpy: 0.270560 hartree
zpe.thermalcorrgfe: 0.199012 hartree
zpe.sumelectzpe: -1376.965138 hartree
zpe.sumelectthermal: -1376.946585 hartree
zpe.sumelectthermalent: -1376.945640 hartree
zpe.sumelectthermalfe: -1377.017188 hartree
dipole: -2.0797 1.5180 -0.0349
dipole: 2.5750
quadrupole: -132.8554 -128.2424 -117.4028
quadrupole: 1.3604 -0.0173 0.2548
quadrupole: -6.6885 -2.0755 8.7641 1.3604 -0.0173 0.2548
hfenergy: -1377.2162002 hartree
pointgroup: C01 [X(C16H13Cl1O4)]
dipole: -0.9215247 -0.4206474 0.0132558 debye
polarizability: 229.4621123|19.6382147|176.2050454|-0.2472307|-0.1976197|161.1143432 unknown
InChI: InChI=1S/C16H13ClO4/c17-12-7-5-11(6-8-12)16(10-9-15(18)19)20-13-3-1-2-4-14(13)21-16/h1-8,18H,9-10H2
charge 0 multiplicity 1
34 atoms
Cl 5.957813 -0.526872 -0.002561
O  -0.763812 -0.238309 -1.195804
O  -0.763099 -0.250187 1.200347
O  -3.689074 3.854613 0.045295
O  -1.487259 4.587111 -0.029093
C  -0.125399 0.410274 0.005276
C  -0.470712 1.900615 0.012943
C  1.374328 0.12648 0.003219
C  -1.985768 2.159727 0.013978
C  -1.36107 -1.428831 -0.709239
C  -1.360636 -1.435808 0.702418
C  2.078544 0.018837 1.226152
C  2.077726 0.034654 -1.221502
C  -1.932551 -2.462208 -1.454645
C  -1.931739 -2.476589 1.437782
C  -2.303376 3.639577 0.007056
C  3.47608 -0.182514 1.231833
C  3.475221 -0.166584 -1.230754
C  -2.513755 -3.534652 -0.720732
C  -2.513354 -3.541669 0.693551
C  4.152572 -0.268658 -0.000291
H  0.003146 2.359245 0.899427
H  0.002876 2.369781 -0.868034
H  -2.463218 1.696412 -0.869444
H  -2.464728 1.700967 0.898282
H  1.530518 0.071726 2.171955
H  1.52912 0.099787 -2.166196
H  -1.930876 -2.44561 -2.547668
H  -1.929543 -2.470876 2.530915
H  4.025593 -0.272541 2.173072
H  4.024101 -0.244379 -2.173457
H  -2.966017 -4.368943 -1.266551
H  -2.965323 -4.381337 1.231307
H  -3.868428 4.834161 0.035761
