program: Gaussian 09
title: 000039822
version: EM64L-G09RevD.01
frameworkgroup: C1[X(C23H27NO6)]
method: RPBEPBE
basis: SDD
operation: Freq
keyword: #p
keyword: freq=noraman
keyword: PBEPBE/SDD
title: #p freq=noraman PBEPBE/SDD
converged: YES YES NO NO
title: Mulliken charges:
elementType: O O O O O O N C C C C C C C C C C C C C C C C C C C C C C C H H H H H H H H H H H H H H H H H H H H H H H H H H H
charge: -0.277473 -0.292263 -0.247742 -0.258435 -0.253762 -0.224073 -0.100181 0.080910 -0.343916 -0.330223 -0.343533 -0.349142 -0.330279 -0.498603 0.444799 -0.295913 0.205293 0.195756 0.272868 -0.387622 -0.378180 -0.243911 -0.359233 -0.338344 -0.269095 -0.220564 -0.228796 -0.219934 -0.251613 -0.237457 0.187972 0.238982 0.207110 0.192502 0.227856 0.175793 0.203367 0.233889 0.205914 0.214199 0.248705 0.243071 0.193166 0.205504 0.261790 0.262352 0.197052 0.191074 0.249362 0.323631 0.255746 0.223393 0.229284 0.228581 0.224188 0.225556 0.230625
chargesum: 0.00000
title: Mulliken charges with hydrogens summed into heavy atoms:
elementType: O O O O O O N C C C C C C C C C C C C C C C C C C C C C C C
charge: -0.277473 -0.292263 -0.247742 -0.258435 -0.253762 -0.224073 -0.100181 0.080910 0.083038 0.069389 0.060117 0.088113 0.089834 -0.006828 0.444799 0.102757 0.205293 0.195756 0.272868 -0.125833 -0.115827 0.144215 -0.109871 -0.014713 0.210044 0.008720 -0.000215 0.004253 -0.026057 -0.006832
polarizability: 3.12222866e+02 1.41738634e+01 2.64947412e+02 -1.21904465e+01 -2.98690663e+01 2.25683170e+02
1716.lowfreq: -4.5493 -0.0005 0.0002 0.0004 3.8622 4.4788 18.9682 26.6296 30.2896
frequency: 18.8541 26.5512 29.0831 35.0494 41.0031 44.6387 52.2106 55.3821 69.1659 73.0689 105.0851 115.1974 135.7699 143.4097 156.8482 189.7519 202.2083 218.9796 228.2069 243.0864 251.3879 255.2767 277.2161 292.5551 300.4031 306.5767 308.7480 318.2751 390.2136 394.4752 400.0248 412.9106 424.9374 454.9994 470.0642 476.1847 516.9518 531.2937 546.1489 549.9654 555.1624 593.5534 597.4504 616.4983 621.4166 662.2660 704.1950 706.3049 706.9838 732.2837 750.2257 754.1581 771.3662 780.7682 786.3820 802.1681 806.6486 810.4122 836.2973 843.3813 856.5731 861.2916 899.2208 905.4168 917.9341 928.2041 934.4967 940.7450 958.2504 979.7505 980.8250 982.2804 990.3522 998.5878 1014.0377 1015.4158 1017.4384 1028.6245 1032.3404 1043.6003 1050.0882 1057.6737 1063.1220 1075.4876 1077.2906 1085.2478 1097.0763 1108.5740 1119.7431 1126.3559 1151.7906 1161.8350 1163.1183 1172.0047 1174.2618 1187.8062 1195.5805 1203.3977 1216.7678 1231.0296 1241.5939 1246.8560 1250.2216 1260.5906 1264.7032 1281.8679 1292.6182 1294.8345 1311.5350 1318.5019 1332.8807 1343.2167 1344.5190 1361.7891 1367.1828 1372.7828 1382.7965 1391.7605 1408.0046 1413.2933 1428.9889 1436.5290 1444.5463 1446.2677 1447.2694 1450.0405 1451.1504 1459.8425 1460.8304 1467.5403 1469.7776 1483.1726 1487.4294 1593.1156 1603.7699 1614.6598 1627.2258 1635.6093 2824.4463 2851.4915 2863.2812 2919.0254 2929.2906 2959.5813 2961.2589 2979.5463 2979.8971 3016.6158 3017.4146 3019.4825 3041.1163 3043.5232 3076.4132 3081.0217 3086.0743 3094.4727 3113.3104 3128.3444 3136.3156 3139.1863 3152.5714 3157.7568 3163.0684 3172.5389 3181.1351
redmass: 4.1266 4.7926 5.1640 5.7919 3.4214 6.0305 6.1796 3.8581 8.1627 4.9109 5.2333 4.6473 6.1854 4.0877 3.9145 4.0663 5.1156 2.6532 4.8427 1.8950 5.1966 2.5258 3.3623 6.5792 5.2802 3.1434 2.8554 3.4110 1.8797 2.3897 2.8367 4.2133 3.3199 4.8365 2.9312 2.9288 5.6468 4.6970 4.2276 3.0450 7.3970 2.0246 7.1158 6.4817 4.7441 5.9078 2.1872 4.2447 5.3253 2.8001 3.4293 1.4959 1.9388 3.3555 2.4178 6.1738 5.1974 3.9602 6.1888 1.5720 1.2535 1.3283 2.4781 2.9628 2.2154 1.8286 2.2021 1.3319 2.5458 1.4131 2.4493 1.6232 5.9791 1.3308 2.2758 2.6694 2.7650 2.1431 2.0020 2.3699 2.4602 3.5785 2.9400 2.7176 3.0469 1.7418 2.8739 2.2759 2.4450 1.6560 2.5387 2.3432 2.2189 1.2791 1.0663 1.1135 1.0830 1.1151 1.1677 3.1171 2.3753 1.3719 1.2309 1.2942 1.2021 1.3025 1.3467 1.3929 1.8100 1.3228 1.2796 1.2408 1.2349 1.4144 1.4303 1.2696 9.2457 1.4448 5.9968 1.5268 1.1038 2.2128 2.3719 1.0848 1.0857 1.0918 1.1004 1.0892 1.1036 1.1285 2.4851 2.3480 1.0786 6.4074 7.2239 6.1175 8.0143 10.3413 1.0704 1.0703 1.0689 1.0568 1.0568 1.0667 1.1021 1.1002 1.0653 1.0893 1.0602 1.0875 1.0586 1.0893 1.1001 1.0985 1.1062 1.0977 1.1039 1.0850 1.0872 1.0887 1.0934 1.0948 1.0964 1.0995 1.0971
irintensity: 0.0824 0.0224 0.8200 0.8985 0.1685 0.5668 0.3317 0.1752 0.7030 0.3895 2.5976 0.6504 2.8513 4.3419 3.8859 3.9981 2.8044 3.1711 1.1500 0.4570 1.9195 1.5908 4.0933 2.0257 1.9739 2.0251 28.3638 0.7594 0.2198 0.8598 0.0702 5.1130 3.1332 7.3307 1.9250 7.0440 2.1588 12.9019 0.4403 1.8740 1.8493 5.9358 0.2495 0.0115 19.8511 0.9180 31.3602 34.5379 3.4881 17.2137 8.0868 94.6449 39.9312 16.7693 11.0401 49.5024 8.9511 16.0372 6.5604 0.1954 0.1395 2.2414 9.4876 15.4501 43.7701 12.9725 50.2003 6.4894 4.0563 0.5680 20.7449 22.1922 0.2739 1.9635 21.7890 14.8109 15.4373 11.0946 4.1500 29.7997 39.9491 92.4889 114.3445 7.3393 24.9204 27.3391 70.7258 13.4176 6.3314 77.8183 40.0082 85.1797 12.7469 23.4417 2.3012 10.8949 1.5251 5.1316 6.4907 224.2080 6.2895 56.8282 52.6618 31.5468 9.4818 13.0904 13.2340 12.7353 141.3525 2.9816 4.2834 30.6166 12.6043 0.1698 3.8331 0.9630 0.1146 3.8708 1.6059 1.7856 12.9035 11.8660 8.3368 1.8006 13.7328 4.3460 11.2700 6.9871 29.6541 16.4104 127.4161 8.6863 9.1913 0.7239 1.2292 0.4417 4.7455 187.0544 83.4386 49.0401 215.6239 52.4085 144.5196 49.2908 53.3811 24.4398 56.4851 15.2683 33.4583 65.0806 6.8007 29.4070 37.0398 45.9354 17.1605 73.8552 1.3258 0.0383 1.5035 10.2797 23.4267 24.8399 18.5095 11.7389 9.5212
temp: 298.150 k
press: 1.00000 atm
elementType: 8 8 8 8 8 8 7 6 6 6 6 6 6 6 6 6 6 6 6 6 6 6 6 6 6 6 6 6 6 6 1 1 1 1 1 1 1 1 1 1 1 1 1 1 1 1 1 1 1 1 1 1 1 1 1 1 1
symmnumber: 1
zpe: 1208714.1 jmol-1
zpe.correction: 0.460375 hartree
zpe.thermalcorrener: 0.488078 hartree
zpe.thermalcorrenthalpy: 0.489022 hartree
zpe.thermalcorrgfe: 0.399642 hartree
zpe.sumelectzpe: -1396.440082 hartree
zpe.sumelectthermal: -1396.412379 hartree
zpe.sumelectthermalent: -1396.411435 hartree
zpe.sumelectthermalfe: -1396.500815 hartree
dipole: -3.1759 -0.1190 -2.8598
dipole: 4.2755
quadrupole: -147.8489 -187.4287 -165.5397
quadrupole: 12.9986 0.8455 -1.6385
quadrupole: 19.0902 -20.4896 1.3994 12.9986 0.8455 -1.6385
hfenergy: -1396.9004569 hartree
pointgroup: C01 [X(C23H27N1O6)]
dipole: 1.3944879 0.0363579 -0.9399556 debye
polarizability: 304.8668967|15.6529126|275.0640396|19.7875131|27.6121345|222.9225121 unknown
InChI: InChI=1S/C23H27NO6/c25-22(28-17-16-27-15-12-24-10-13-26-14-11-24)18-23(19-6-2-1-3-7-19)29-20-8-4-5-9-21(20)30-23/h1-9H,10-18H2
charge 0 multiplicity 1
57 atoms
O  -2.643677 0.991407 0.535661
O  -0.656523 -0.225767 -0.016349
O  2.471891 -3.563842 1.22597
O  3.044233 1.591764 -0.878594
O  0.292655 1.863534 -1.976917
O  -1.460053 3.324448 -1.492769
N  3.575625 -0.950722 0.568645
C  -2.021122 0.112596 -0.514093
C  2.999083 -1.828831 -0.483318
C  4.092296 -1.754751 1.708593
C  4.619288 -0.019333 0.077866
C  1.92862 -2.752478 0.12256
C  2.989537 -2.665377 2.270153
C  -1.905747 0.915349 -1.846722
C  -2.851612 -1.147071 -0.684072
C  4.243642 0.80112 -1.158445
C  -1.575014 1.384792 1.38053
C  -0.395252 0.690575 1.041871
C  -1.050499 2.168523 -1.742313
C  -2.226199 -2.389987 -0.940678
C  -4.264308 -1.062832 -0.636004
C  2.64822 2.421389 -2.019956
C  -1.613071 2.310793 2.425381
C  0.818108 0.90077 1.700238
C  1.259147 2.973889 -1.753782
C  -3.012795 -3.544903 -1.147447
C  -5.046542 -2.219804 -0.842706
C  -0.392973 2.529508 3.12432
C  0.793496 1.845939 2.764839
C  -4.42362 -3.46286 -1.10293
H  3.789276 -2.451979 -0.975301
H  2.513103 -1.199946 -1.250388
H  4.443176 -1.065439 2.501209
H  4.961639 -2.38925 1.39689
H  4.864474 0.67484 0.90453
H  5.564558 -0.567014 -0.185129
H  1.573594 -3.478487 -0.628334
H  1.07488 -2.144705 0.486271
H  2.16059 -2.048593 2.678497
H  3.38532 -3.323618 3.061252
H  -2.925251 1.207458 -2.148135
H  -1.480602 0.233896 -2.602348
H  5.102624 1.467451 -1.402482
H  4.068281 0.147812 -2.041661
H  -1.13377 -2.450163 -0.955565
H  -4.741175 -0.103445 -0.40984
H  2.644075 1.826134 -2.959274
H  3.362732 3.266484 -2.143979
H  -2.531496 2.84559 2.680124
H  1.737078 0.389565 1.385264
H  1.162557 3.326935 -0.712092
H  1.015649 3.806024 -2.439799
H  -2.525166 -4.507597 -1.336665
H  -6.139091 -2.153102 -0.796068
H  -0.375156 3.251915 3.94728
H  1.721477 2.052954 3.308553
H  -5.031907 -4.360156 -1.262345
