program: Gaussian 09
title: 000039732
version: EM64L-G09RevD.01
frameworkgroup: C1[X(C12H4Cl4O2)]
method: RPBEPBE
basis: SDD
operation: Freq
keyword: #p
keyword: freq=noraman
keyword: PBEPBE/SDD
title: #p freq=noraman PBEPBE/SDD
converged: NO NO NO YES
title: Mulliken charges:
elementType: Cl Cl Cl Cl O O C C C C C C C C C C C C H H H H
charge: 0.004108 0.009752 0.009131 -0.028205 -0.252133 -0.273610 0.280450 0.258790 0.388053 0.313493 -0.346859 -0.343620 -0.306051 -0.372246 -0.084134 -0.084792 -0.244248 -0.091266 0.294264 0.291339 0.291703 0.286083
chargesum: 0.00000
title: Mulliken charges with hydrogens summed into heavy atoms:
elementType: Cl Cl Cl Cl O O C C C C C C C C C C C C
charge: 0.004108 0.009752 0.009131 -0.028205 -0.252133 -0.273610 0.280450 0.258790 0.388053 0.313493 -0.052596 -0.052281 -0.306051 -0.080543 -0.084134 -0.084792 0.041836 -0.091266
polarizability: 3.10730651e+02 -8.31698364e+00 1.86655758e+02 -1.81683810e-03 -7.84108303e-03 6.08505287e+01
1716.lowfreq: -3.7414 0.0007 0.0016 0.0018 5.4724 6.3276 27.6528 45.8770 99.9068
frequency: 27.6451 45.8742 99.9064 118.9464 137.0669 155.3588 156.3127 183.3083 202.8664 206.0086 259.0832 263.8595 322.4875 334.4118 367.7270 377.9667 392.3533 444.1222 444.3118 514.5616 515.6461 519.6592 546.0322 567.6852 587.5255 630.1048 655.4640 676.3671 679.2913 733.7001 785.7411 828.2990 842.5241 844.0462 856.6700 869.7897 888.6511 929.3548 1069.1207 1097.3781 1104.8084 1133.5656 1199.1418 1216.8114 1221.5179 1274.4958 1352.6789 1362.3664 1377.5935 1401.1706 1446.8568 1465.9066 1567.2510 1578.7747 1594.5576 1628.6314 3181.9319 3183.9623 3187.7198 3189.1785
redmass: 16.7060 19.6042 20.6566 10.5648 11.3726 10.5589 28.8155 28.7577 16.4539 5.1151 7.0096 18.6412 13.0838 9.0387 12.1267 15.0328 12.5082 8.4773 3.0988 5.0525 6.6713 8.4817 5.2761 10.7283 11.0498 9.2276 4.2081 4.9401 8.6056 7.4306 9.1377 6.7685 1.4108 1.4038 1.3888 1.3848 9.3320 10.7533 2.1435 1.6930 8.4090 4.0883 1.5463 3.6015 1.3077 4.7588 7.2244 10.0596 7.2358 5.2606 3.9815 4.0410 9.9157 8.3397 10.1786 8.9464 1.0925 1.0934 1.0930 1.0939
irintensity: 0.0066 0.0001 0.0105 0.0897 0.0333 1.0311 0.2375 0.0503 0.0984 0.2550 0.0012 0.2322 0.2273 0.0251 2.9541 7.8084 3.4169 11.7135 9.2233 0.4499 1.1996 1.9423 6.1239 6.0648 0.5562 3.4457 1.9652 6.2063 14.0818 7.1844 95.3824 24.7354 9.7769 20.9244 15.4397 62.0389 116.2141 131.4282 2.9414 103.9853 30.4393 41.5889 1.0482 0.5709 0.4533 258.8519 19.5471 82.2091 9.9288 86.8403 614.3299 318.5764 69.7137 26.7568 30.5296 22.8646 4.0521 1.3883 2.7869 2.6314
temp: 298.150 k
press: 1.00000 atm
elementType: 17 17 17 17 8 8 6 6 6 6 6 6 6 6 6 6 6 6 1 1 1 1
symmnumber: 1
zpe: 328052.8 jmol-1
zpe.correction: 0.124949 hartree
zpe.thermalcorrener: 0.140337 hartree
zpe.thermalcorrenthalpy: 0.141281 hartree
zpe.thermalcorrgfe: 0.080547 hartree
zpe.sumelectzpe: -2449.093061 hartree
zpe.sumelectthermal: -2449.077672 hartree
zpe.sumelectthermalent: -2449.076728 hartree
zpe.sumelectthermalfe: -2449.137462 hartree
dipole: 1.0482 -0.6379 0.0000
dipole: 1.2271
quadrupole: -139.9076 -127.5228 -131.9352
quadrupole: 0.8746 0.0003 -0.0002
quadrupole: -6.7858 5.5991 1.1867 0.8746 0.0003 -0.0002
hfenergy: -2449.2180094 hartree
pointgroup: C01 [X(C12H4Cl4O2)]
dipole: 0.412273 0.2511712 -0.0000026 debye
dipolederiv: -0.0779173 0.0155077 0.0000007 0.0850126 -0.6774186 0.0000659 -0.0000027 0.0000636 -0.0199015 -0.6164757 -0.2734395 0.0000135 -0.372109 -0.2324401 0.0000117 0.0000286 0.0000162 -0.0184846 -0.6127565 0.2853614 -0.000019 0.376627 -0.2439584 0.0000138 -0.0000174 0.0000102 -0.0187983 -0.7302618 -0.3019779 0.0000194 -0.3541027 -0.2937058 0.0000135 0.0000353 0.0000134 -0.048094 -2.1735442 0.0318597 -0.0000436 0.0245147 -0.278093 0.000003 -0.0000639 -0.00001 -0.1272881 -2.1652332 0.0347678 -0.000045 0.0078532 -0.3807444 0.0000185 -0.0000742 0.0000287 -0.148618 1.337571 -0.1959144 0.0000146 -0.9891288 0.1600817 -0.000023 0.0000502 0.0000018 0.0736466 1.2960914 0.135543 0.0000029 0.9676811 0.1226897 0.0000153 -0.0000348 -0.0000068 0.072537 1.1756883 0.1480599 0.0000471 1.0761191 -0.2575871 0.0000635 0.0000226 0.0000539 0.0853848 1.3662508 -0.1168433 0.0000613 -0.9063181 0.3106698 -0.0000417 0.0001344 -0.0000274 0.0967231 -0.4143739 -0.0657624 0.0000006 -0.0925507 -0.0631544 0.0000001 0.0000039 0.0000003 -0.0935216 -0.3951534 0.0705582 -0.0000086 0.0907191 -0.0605425 -0.0000017 -0.000011 -0.0000052 -0.097254 0.1011987 -0.0163704 -0.0000137 -0.1888306 1.0983849 -0.0001256 -0.0000105 -0.0001281 -0.0768307 -0.6067494 -0.0580892 -0.0000059 -0.1313162 -0.1086029 -0.0000054 -0.0000115 -0.0000136 -0.1322925 0.7169405 0.5589536 -0.0000335 0.6419733 0.2811114 -0.0000206 -0.0000528 -0.0000283 -0.0639271 0.6967472 -0.5623307 0.0000349 -0.6488825 0.3034444 -0.0000211 0.0000314 -0.0000132 -0.0643442 -0.3713512 -0.1269658 0.0000066 -0.1460489 -0.4051742 0.0000372 0.0000185 0.0000329 -0.0791608 1.1072737 0.388979 -0.0000312 0.5169777 0.5050717 -0.0000338 -0.0000469 -0.0000348 -0.0659521 0.1010045 0.0239311 -0.0000008 0.0171532 0.0473809 0.0000085 0.0000014 0.0000099 0.1812846 0.0993754 -0.0232439 0.0000011 -0.0174735 0.0428711 0.000007 0.0000006 0.0000055 0.1816539 0.1148679 0.0154199 -0.000002 0.0143636 0.0418272 0.0000104 0.0000008 0.0000194 0.1866436 0.050807 0.0319962 0.0000006 0.0277667 0.0878885 0.0000046 -0.000002 0.0000115 0.1765937 unknown
polarizability: 310.7226696|8.3763001|186.6637388|0.0018206|-0.0078402|60.8505287 unknown
InChI: InChI=1S/C12H4Cl4O2/c13-5-1-8(16)12-11(2-5)17-9-3-6(14)7(15)4-10(9)18-12/h1-4H
charge 0 multiplicity 1
22 atoms
Cl 2.57562 -3.122272 0.000331
Cl -5.029682 -1.548908 0.000054
Cl -5.019155 1.746001 -0.000138
Cl 5.33443 1.698677 -0.000044
O  0.143124 -1.380885 0.000019
O  0.154223 1.541845 -0.000125
C  -1.055148 -0.622854 -0.00001
C  -1.050898 0.793668 -0.000082
C  1.343237 -0.630987 0.000068
C  1.355226 0.787969 0.000007
C  -2.266823 -1.326143 0.000037
C  -2.257857 1.504874 -0.000122
C  2.572571 -1.316361 0.00014
C  2.558972 1.508297 0.00002
C  -3.484695 -0.612546 -0.000012
C  -3.480377 0.799122 -0.000092
C  3.800784 -0.621571 0.00007
C  3.767852 0.784811 0.000027
H  -2.254969 -2.418723 0.00011
H  -2.2402 2.597332 -0.000176
H  2.534084 2.60012 -0.000054
H  4.745481 -1.169769 0.000075
