program: Gaussian 09
title: 000005579
version: EM64L-G09RevD.01
frameworkgroup: C1[X(C9H15N2)]
method: RPBEPBE
basis: SDD
operation: Freq
keyword: #p
keyword: freq=noraman
keyword: PBEPBE/SDD
title: #p freq=noraman PBEPBE/SDD
converged: YES YES NO NO
title: Mulliken charges:
elementType: N N C C C C C C C C C H H H H H H H H H H H H H H H
charge: -0.238722 -0.689552 0.615792 -0.557409 -0.557466 -0.597060 -0.561618 -0.406075 0.518710 -0.213382 -0.420386 0.279789 0.255529 0.276995 0.277063 0.255551 0.279759 0.275419 0.265636 0.275500 0.251456 0.242233 0.252406 0.253156 0.339056 0.327619
chargesum: 1.00000
title: Mulliken charges with hydrogens summed into heavy atoms:
elementType: N N C C C C C C C C C
charge: -0.238722 -0.022877 0.615792 0.254904 0.254907 0.219494 -0.310161 -0.163841 0.518710 0.039024 -0.167230
polarizability: 1.39486705e+02 -6.84188426e+00 1.15838384e+02 1.15861451e-03 -9.93939011e-04 6.52919060e+01
1716.lowfreq: -10.1024 -0.0007 -0.0007 -0.0004 9.7091 13.8651 45.4417 130.7151 173.7786
frequency: 44.6369 130.6896 173.7230 212.6834 214.0325 250.0912 290.7480 323.3626 329.5100 357.5149 403.9965 405.9635 410.8301 462.7335 477.3400 514.6536 524.7560 542.4086 625.8262 684.2539 688.9610 774.3052 798.9799 850.2423 879.0543 905.1620 918.9581 936.4720 979.3047 983.7550 1037.6988 1042.0211 1086.8591 1102.3805 1110.4318 1129.0400 1197.8558 1215.3737 1221.9977 1248.5947 1317.0063 1341.9369 1404.4329 1415.4784 1420.6837 1448.0946 1453.4128 1463.6580 1466.0628 1474.2855 1478.9210 1482.4059 1499.9082 1509.9333 1578.3213 1641.7661 1660.8918 3028.4545 3029.1219 3033.6938 3142.0752 3142.7216 3147.6367 3149.6901 3156.1610 3158.0689 3163.7060 3167.7028 3171.6001 3178.8174 3556.8321 3691.1827
redmass: 3.1917 2.5851 1.0953 2.7184 3.4613 1.1187 2.9174 1.0758 2.9486 3.0980 2.6973 1.6544 1.3437 2.4356 3.0745 1.2684 5.2083 3.2275 4.3811 5.8946 1.8901 1.3809 3.7384 1.8557 1.4487 3.7774 2.6512 2.7252 6.0620 1.3441 1.5150 1.1914 1.7019 1.3014 1.4829 1.4228 1.0842 1.8721 1.8327 1.9047 1.4919 1.9154 5.6724 1.1445 1.1367 1.0477 1.1737 1.0426 1.0952 1.1851 2.2838 1.0462 1.1108 2.5070 6.3109 3.9024 1.3087 1.0324 1.0323 1.0333 1.1054 1.1055 1.0883 1.1054 1.1054 1.0930 1.1050 1.1029 1.0913 1.0990 1.0462 1.1039
irintensity: 0.8013 1.5309 0.0000 1.2685 3.8229 0.2533 1.3964 1.5420 2.6074 2.4842 2.7859 0.8186 3.0025 53.4806 1.7603 254.9345 0.2258 0.0527 5.6303 0.0211 29.6369 32.1170 18.3718 40.2525 9.3547 28.9864 23.8080 14.2602 16.2014 1.2518 5.6718 0.0520 5.0778 0.6057 1.8564 4.9943 8.8035 0.0625 0.0976 5.6994 10.4180 16.5180 21.6212 16.3706 17.2800 0.0059 11.0678 2.8493 15.5817 31.6901 25.9651 34.2573 109.2004 35.1178 39.4551 108.9022 287.9164 2.9027 3.9783 6.8710 0.0950 0.2735 2.6315 17.3380 1.8002 10.6626 0.9941 1.4693 4.5867 0.8706 125.2968 35.1653
temp: 298.150 k
press: 1.00000 atm
elementType: 7 7 6 6 6 6 6 6 6 6 6 1 1 1 1 1 1 1 1 1 1 1 1 1 1 1
symmnumber: 1
zpe: 600895.4 jmol-1
zpe.correction: 0.228869 hartree
zpe.thermalcorrener: 0.240194 hartree
zpe.thermalcorrenthalpy: 0.241139 hartree
zpe.thermalcorrgfe: 0.192785 hartree
zpe.sumelectzpe: -460.367861 hartree
zpe.sumelectthermal: -460.356536 hartree
zpe.sumelectthermalent: -460.355592 hartree
zpe.sumelectthermalfe: -460.403945 hartree
dipole: -3.6924 -2.1722 0.0003
dipole: 4.2840
quadrupole: -24.9338 -48.0739 -64.7427
quadrupole: -2.7029 0.0010 -0.0003
quadrupole: 20.9830 -2.1571 -18.8259 -2.7029 0.0010 -0.0003
hfenergy: -460.5967302 hartree
pointgroup: C01 [X(C9H15N2)]
dipole: -1.4670746 -0.829688 -0.0024232 debye
dipolederiv: -0.3486981 -0.0234128 -0.0001066 0.0170973 -0.2734027 -0.0000989 0.0004471 -0.000001 -0.2504514 -0.8730424 0.6748073 0.0024934 0.7767462 -0.7870607 -0.0005859 0.0028873 -0.0005786 -0.6956822 0.6068835 -0.0540958 -0.0005703 0.1629958 0.4571154 0.0018436 -0.0001061 0.001863 -0.0780318 0.0834548 -0.0448824 0.1028263 -0.0739543 0.0700024 -0.0835919 0.1667791 -0.0723488 0.2466438 0.0828525 -0.0438117 -0.1030198 -0.0723185 0.0685185 0.0820066 -0.1673363 0.0707781 0.2485032 0.036282 0.0240838 0.000202 0.0848856 0.2895336 0.0010754 0.0004098 0.0010162 0.0619186 -0.4521083 0.4657689 0.0017852 -0.1594864 -0.1516468 0.0003169 -0.0004729 0.0001653 -0.2129264 -0.4246509 -0.0840787 -0.0001977 -0.078381 -0.3239469 -0.0004375 -0.000127 -0.0004929 -0.2050804 0.8900516 -0.8343653 -0.0032291 -0.9286485 0.8027011 0.0024984 -0.0035319 0.0024616 0.1870011 0.3945868 0.0338124 -0.0000358 -0.1093981 0.201251 0.0010728 -0.0005442 0.0010205 -0.0810498 0.0006702 -0.003893 -0.0000875 0.5090757 -0.349592 -0.000716 0.0017735 -0.0005459 -0.1964622 0.090715 0.0560902 0.0589662 0.0519357 0.0724982 -0.0625241 0.039119 -0.0187137 0.0319655 -0.0819912 -0.0370646 -0.0152163 -0.07709 0.1079233 0.0205691 0.0240404 0.0277715 0.0802791 0.1595511 -0.0518499 -0.0149077 -0.0222648 -0.028978 0.0075541 -0.0037566 -0.044506 0.0898785 0.1594602 -0.051896 0.0144009 -0.022316 -0.0292612 -0.0086338 0.0034071 0.0434954 0.0901938 -0.0820351 -0.0372782 0.0151299 -0.076831 0.1083632 -0.0201883 -0.0243825 -0.0274598 0.0798369 0.0905571 0.0567007 -0.058551 0.0523903 0.0717308 0.0628625 -0.0387669 0.0189735 0.0328819 0.1130391 0.0493659 -0.0761719 0.0140532 0.0685998 0.0067435 -0.0744056 0.0324299 0.0033554 -0.0745917 -0.0309925 -0.0001589 0.0494405 0.0974085 -0.0001601 0.0001926 -0.0001676 0.1296049 0.1130767 0.0486728 0.076586 0.0134063 0.0689781 -0.0061357 0.0745635 -0.0317562 0.0030855 0.1020973 -0.0214076 -0.000057 -0.0517112 -0.0492254 -0.0007672 -0.0001801 -0.0007538 0.1635669 -0.0212398 0.0889477 0.0003684 0.1012853 0.0642399 -0.0003935 0.0004099 -0.000368 0.1705837 0.0773824 -0.0363446 -0.0001089 -0.0422373 -0.0313732 -0.0006608 -0.0001434 -0.0006654 0.1542631 -0.0685565 -0.0227023 -0.0000074 0.0024598 0.0879097 -0.0003081 0.0000865 -0.0002983 0.1736517 0.2714701 -0.0775425 -0.0002512 -0.0288605 0.1531146 -0.0008399 -0.0000901 -0.0008193 0.3891094 0.1547835 -0.0426318 -0.0000814 -0.092274 0.2345988 -0.0005013 -0.0002722 -0.0004995 0.3833613 unknown
polarizability: 139.2461798|-7.2415189|116.0782311|-0.0474493|0.1846558|65.2925834 unknown
InChI: InChI=1S/C9H15N2/c1-11(2,3)9-6-4-5-8(10)7-9/h4-7H,10H2,1-3H3
charge 1 multiplicity 1
26 atoms
N  -1.839836 -0.217216 0.000099
N  2.968153 -1.57227 -0.006283
C  -0.340917 0.118223 0.000725
C  -2.495604 0.383227 -1.25264
C  -2.493722 0.371213 1.259493
C  -2.120532 -1.718359 -0.006994
C  0.61639 -0.911628 -0.003222
C  0.020094 1.482665 0.005646
C  2.007485 -0.577561 -0.002408
C  1.399191 1.800856 0.006364
C  2.382086 0.800082 0.00244
H  -2.006394 -0.043615 -2.140408
H  -3.568858 0.136306 -1.245036
H  -2.359672 1.472528 -1.249608
H  -2.357931 1.460522 1.266436
H  -3.56694 0.124116 1.251393
H  -2.002941 -0.063895 2.142376
H  -1.691294 -2.17783 0.894776
H  -3.211753 -1.860815 -0.00804
H  -1.690598 -2.169354 -0.912709
H  0.33953 -1.968584 -0.007005
H  -0.715042 2.292169 0.008777
H  1.701845 2.852403 0.010073
H  3.442403 1.074047 0.003079
H  3.958007 -1.337785 -0.005706
H  2.721449 -2.558747 -0.009716
