program: Gaussian 09
title: 000039724
version: EM64L-G09RevD.01
frameworkgroup: C1[X(C17H21N3O2)]
method: RPBEPBE
basis: SDD
operation: Freq
keyword: #p
keyword: freq=noraman
keyword: PBEPBE/SDD
title: #p freq=noraman PBEPBE/SDD
converged: YES YES NO NO
title: Mulliken charges:
elementType: O O N N N C C C C C C C C C C C C C C C C C H H H H H H H H H H H H H H H H H H H H H
charge: -0.270277 -0.271895 -0.468260 -0.159593 -0.671455 0.432700 0.334003 -0.435195 -0.333049 -0.356437 -0.353367 0.222866 0.329255 0.194628 -0.385132 -0.347359 -0.340057 -0.365037 -0.240554 -0.241886 -0.687150 -0.686474 0.213702 0.318047 0.246346 0.241987 0.292509 0.246463 0.251872 0.241534 0.244491 0.205769 0.205743 0.203673 0.205574 0.205390 0.230639 0.230529 0.205010 0.231425 0.230121 0.347069 0.301833
chargesum: 0.00000
title: Mulliken charges with hydrogens summed into heavy atoms:
elementType: O O N N N C C C C C C C C C C C C C C C C C
charge: -0.270277 -0.271895 -0.175751 -0.159593 -0.022554 0.432700 0.334003 -0.221493 -0.015002 -0.110091 -0.111380 0.222866 0.329255 0.194628 -0.138670 -0.095487 -0.098523 -0.120546 0.170959 0.167361 -0.020591 -0.019918
polarizability: 3.80909385e+02 1.42919641e+01 2.12829652e+02 -2.29601060e+00 1.06294073e+01 1.38378790e+02
1716.lowfreq: -7.4495 -2.8561 0.0005 0.0008 0.0012 1.3886 19.5776 22.6744 33.7394
frequency: 19.5170 22.6481 33.7369 48.5830 54.7452 73.3528 96.5977 102.9912 114.6421 118.8066 136.4507 152.8505 180.0781 203.1805 233.9052 242.2381 244.7951 272.0976 295.2439 326.3255 359.9791 366.0995 377.3595 385.1852 413.6605 414.5462 438.3029 448.7293 484.4475 513.4118 519.4135 522.7373 532.8006 580.6690 623.4608 630.5232 647.8383 664.7578 711.4853 718.0204 736.1951 764.2937 795.1537 806.2848 808.1126 820.1300 827.4133 836.3123 841.7843 852.0659 902.5369 902.9309 930.8973 933.9437 949.9654 973.6280 981.0194 996.6644 1001.6954 1039.1143 1040.4580 1050.9679 1105.5383 1113.3477 1117.1337 1119.4972 1136.1489 1137.0719 1167.9612 1174.8843 1207.8410 1212.1769 1232.7415 1259.9554 1261.2693 1269.4129 1288.7793 1305.0110 1328.1344 1345.7703 1365.7569 1368.5805 1387.4457 1398.0138 1398.0360 1420.3680 1423.2724 1460.3670 1460.6663 1476.3376 1477.8080 1484.4257 1488.2942 1496.7339 1503.6368 1525.9760 1564.5002 1592.8084 1614.7089 1622.0474 1632.1584 1652.0454 2947.5855 2948.8954 2995.4983 2995.6466 3003.9236 3005.4485 3092.8236 3092.8836 3103.8840 3104.2283 3106.9987 3129.9114 3143.2904 3154.3169 3159.1227 3164.3783 3165.8391 3178.8183 3533.1940 3545.5210 3672.7193
redmass: 3.8994 4.0451 3.6000 3.5985 4.5328 4.1039 5.0237 4.8552 1.7727 1.7741 4.7151 3.9026 5.0273 5.1523 4.3586 1.1945 1.2039 3.4637 1.3796 3.5751 3.5318 5.7602 4.9037 3.9164 2.9947 3.1160 4.2653 4.1068 1.1943 1.8817 2.9950 2.6330 1.7457 4.3622 6.7745 7.0266 6.3259 5.4781 4.3355 3.6899 4.4718 4.5035 3.9317 1.3197 1.3031 1.3034 1.3842 1.3210 1.3063 4.7870 3.1896 3.2203 1.3517 1.3607 1.3319 1.3148 6.0857 2.5915 2.5277 2.8156 2.8908 1.6023 1.3864 1.7417 2.0139 1.5506 1.4376 1.4339 1.1966 1.2008 2.7558 2.9598 3.0798 1.1440 1.1448 4.0189 1.3459 1.4665 2.3447 4.1980 1.3728 1.3814 3.6203 1.2747 1.3394 4.0675 4.0586 1.0404 1.0402 1.1953 1.0817 1.4052 1.1858 1.4163 1.9727 2.8489 7.0457 4.3353 1.6616 3.5149 6.0209 3.6421 1.0553 1.0553 1.0361 1.0361 1.1072 1.1073 1.0989 1.0989 1.1012 1.1012 1.0897 1.0881 1.0872 1.0890 1.0956 1.0944 1.0964 1.0954 1.0455 1.0748 1.1035
irintensity: 0.4593 0.8663 1.0911 1.0618 2.7201 7.3226 1.5207 2.4782 2.4200 2.1040 0.8588 1.9462 3.1414 2.7523 1.2941 1.0165 1.6013 4.0092 77.9276 9.6868 12.4930 6.7674 5.1273 0.4146 2.0786 0.8614 1.6647 11.3748 261.7642 45.4510 7.6434 26.0524 11.1850 14.3166 12.6314 3.0317 11.5196 15.9194 6.6231 0.3009 8.1921 26.9848 6.8418 12.2554 10.5621 70.2575 40.2065 14.3501 26.5961 5.6291 67.0900 32.8004 0.0413 0.1480 1.7750 3.5522 14.5525 4.7915 5.7305 86.0918 69.5616 13.0348 13.0846 1.9903 11.0474 14.8379 4.3377 4.1972 52.3989 99.5036 534.8442 212.9257 37.2121 0.0668 0.0879 32.5714 5.7236 3.2934 38.2793 4.1040 44.2749 17.5211 99.0885 41.3290 12.5433 3.7319 27.8056 11.4120 11.3876 210.2680 31.4854 326.6246 26.0991 136.3383 50.5063 812.4405 13.6568 119.2632 115.2355 38.1998 26.1686 690.8114 44.7638 37.3570 36.4357 27.9215 40.3168 39.6080 26.2680 34.7874 36.2396 36.1502 24.5865 14.3684 19.3243 10.8931 15.2048 8.8708 7.6530 19.5810 42.1821 18.5261 30.8699
temp: 298.150 k
press: 1.00000 atm
elementType: 8 8 7 7 7 6 6 6 6 6 6 6 6 6 6 6 6 6 6 6 6 6 1 1 1 1 1 1 1 1 1 1 1 1 1 1 1 1 1 1 1 1 1
symmnumber: 1
zpe: 920881.5 jmol-1
zpe.correction: 0.350745 hartree
zpe.thermalcorrener: 0.372963 hartree
zpe.thermalcorrenthalpy: 0.373908 hartree
zpe.thermalcorrgfe: 0.297126 hartree
zpe.sumelectzpe: -973.476709 hartree
zpe.sumelectthermal: -973.454491 hartree
zpe.sumelectthermalent: -973.453547 hartree
zpe.sumelectthermalfe: -973.530329 hartree
dipole: -0.9850 1.4392 -0.4373
dipole: 1.7980
quadrupole: -121.5076 -101.3066 -132.5377
quadrupole: -0.9788 7.5534 5.2279
quadrupole: -3.0570 17.1440 -14.0871 -0.9788 7.5534 5.2279
hfenergy: -973.827454 hartree
pointgroup: C01 [X(C17H21N3O2)]
dipole: 0.3792133 0.5957179 0.0416732 debye
polarizability: 381.2236656|-11.8284542|203.8770684|3.4302956|-26.1478102|147.0170932 unknown
InChI: InChI=1S/C17H21N3O2/c1-3-21-15-9-5-13(6-10-15)19-17(18)20-14-7-11-16(12-8-14)22-4-2/h5-12,19H,3-4,18H2,1-2H3
charge 0 multiplicity 1
43 atoms
O  -5.957247 -0.852931 -0.011592
O  5.946931 -0.65531 -0.382005
N  -1.325395 2.3901 -0.42059
N  0.515938 0.962815 0.049516
N  0.829695 3.223886 -0.74724
C  -2.43015 1.501766 -0.295863
C  -4.748243 -0.135854 -0.094491
C  -3.733114 2.061295 -0.431108
C  -2.30459 0.111758 -0.05115
C  -4.878357 1.255518 -0.329475
C  -3.457249 -0.700377 0.042014
C  1.890762 0.619409 -0.056065
C  4.608541 -0.254152 -0.200424
C  0.046111 2.117014 -0.372507
C  2.556997 0.101613 1.086103
C  2.618463 0.671394 -1.286492
C  3.901492 -0.326383 1.025973
C  3.95515 0.238848 -1.35701
C  -5.87078 -2.302038 0.24324
C  6.659101 -1.19439 0.789809
C  -7.302648 -2.828814 0.296246
C  8.068492 -1.553536 0.325508
H  -3.851016 3.136619 -0.621181
H  -1.304634 -0.306979 0.077976
H  -5.880823 1.682014 -0.431557
H  -3.325775 -1.770196 0.230092
H  -1.57143 3.379995 -0.46874
H  1.997518 0.035436 2.024893
H  2.113904 1.017175 -2.196203
H  4.376628 -0.715265 1.93175
H  4.509373 0.263528 -2.300942
H  -5.293261 -2.788458 -0.570482
H  -5.341544 -2.478589 1.202943
H  6.683591 -0.429374 1.594069
H  6.122392 -2.087798 1.172139
H  -7.301068 -3.917504 0.487238
H  -7.869829 -2.332151 1.101969
H  -7.821785 -2.641237 -0.65924
H  8.653822 -1.96594 1.167581
H  8.031611 -2.307974 -0.478812
H  8.590025 -0.661031 -0.060521
H  1.838852 3.14197 -0.638468
H  0.477745 3.937228 -1.3822
