program: Gaussian 09
title: 000039772
version: EM64L-G09RevD.01
frameworkgroup: C1[X(C19H22BrNO3)]
method: RPBEPBE
basis: SDD
operation: Freq
keyword: #p
keyword: freq=noraman
keyword: PBEPBE/SDD
title: #p freq=noraman PBEPBE/SDD
converged: NO YES NO NO
title: Mulliken charges:
elementType: Br O O O N C C C C C C C C C C C C C C C C C C C H H H H H H H H H H H H H H H H H H H H H H
charge: -0.075228 -0.245864 -0.428796 -0.319253 -0.467743 0.422135 -0.237636 -0.119815 -0.122475 -0.474386 -0.515439 -0.520897 -0.409527 -0.409661 -0.442936 -0.668573 0.170755 0.362411 0.036531 -0.338263 -0.296829 -0.212825 0.160958 -0.244963 0.212703 0.215157 0.247430 0.234922 0.206113 0.209092 0.199864 0.254121 0.224967 0.227590 0.224273 0.228200 0.203387 0.200626 0.233223 0.243405 0.378253 0.315979 0.277134 0.234589 0.236668 0.390621
chargesum: 0.00000
title: Mulliken charges with hydrogens summed into heavy atoms:
elementType: Br O O O N C C C C C C C C C C C C C C C C C C C
charge: -0.075228 -0.245864 -0.038175 -0.319253 -0.089490 0.422135 -0.237636 0.092888 0.092682 0.007967 -0.100233 -0.066911 0.043030 0.042813 -0.038923 -0.191945 0.170755 0.362411 0.036531 -0.022284 -0.019695 0.021763 0.160958 -0.008295
polarizability: 2.70676447e+02 -3.84017935e+01 2.38052288e+02 3.12930299e+01 1.67274421e+01 2.02306409e+02
1716.lowfreq: -6.9668 -1.3282 0.0002 0.0003 0.0005 7.1862 10.1868 20.1518 42.0128
frequency: 7.2551 19.5898 40.7150 69.6742 81.1891 114.8220 124.5604 147.5554 162.8628 167.5320 188.6537 221.5585 231.8875 249.5737 276.2818 312.0687 318.3014 330.7342 354.1821 386.8990 394.2573 395.3987 415.0360 421.7701 426.7469 429.9049 439.8218 497.2070 511.8440 539.7308 548.7015 584.5021 604.7903 638.4038 649.5641 668.3155 688.0682 704.4459 741.5633 762.9600 766.7568 784.1772 790.9891 802.0518 820.0292 835.4210 869.7328 876.2299 889.2616 897.1051 904.7566 906.5012 908.5847 938.7974 948.8341 969.9140 978.5112 981.3182 983.3010 1004.6426 1012.3771 1017.7218 1041.7181 1043.2969 1046.8034 1055.1514 1095.1515 1102.2632 1104.6663 1109.4494 1114.3257 1126.8017 1161.4079 1163.8285 1167.3997 1178.8498 1222.3382 1230.1668 1250.6208 1254.5783 1269.9214 1275.8023 1283.2867 1288.5118 1291.6742 1299.7135 1307.8224 1315.5196 1318.9804 1324.8243 1331.0726 1335.8681 1346.0664 1353.6558 1361.0163 1387.3090 1437.6935 1448.2310 1453.1013 1454.0369 1461.5360 1463.3931 1466.3221 1467.8721 1485.9521 1519.1449 1579.5286 1585.2376 1618.9320 1649.9972 2959.7135 2970.3074 2979.3039 2984.4129 2987.5361 2993.1629 2996.3058 3006.9262 3014.2732 3018.4780 3029.8593 3046.9605 3051.8751 3055.9239 3061.6917 3064.8631 3139.2574 3159.9149 3181.8440 3195.0785 3264.1302 3530.5951
redmass: 8.3039 8.0771 5.4041 9.6161 9.9290 4.8693 6.8059 5.1832 4.5381 4.4241 3.3036 7.6358 3.5507 5.4206 4.9474 7.7450 2.1589 2.8256 2.7524 3.2839 4.4580 4.6344 2.8318 3.1944 2.5584 1.8060 1.7209 5.4140 2.9339 3.4324 4.2743 1.2025 5.0414 4.1474 4.6029 4.8278 4.3203 4.9889 4.9874 2.7232 4.9143 3.5038 1.7618 2.9915 3.1074 4.0928 1.5883 1.5995 1.6748 1.6557 3.6783 1.3380 1.3750 2.7641 3.5790 2.3492 2.1443 2.1788 1.3678 2.1909 1.3181 5.4321 2.1540 1.8973 1.8587 1.7380 1.6793 1.8214 1.2128 1.1923 1.9165 1.4724 1.3538 1.6548 1.1519 1.1129 1.6344 2.6278 1.7085 1.5927 1.4704 1.7677 1.8666 1.6498 1.7565 1.7346 1.7024 1.7315 1.3933 1.5937 2.5318 1.4708 1.5378 1.6406 1.5836 9.2093 2.5054 1.1067 1.0910 1.1922 1.2215 1.0961 1.7400 1.1336 1.0949 2.8355 5.6570 7.0496 6.1642 2.3255 1.0599 1.0618 1.0633 1.0606 1.0606 1.0682 1.0666 1.0760 1.0791 1.1027 1.1026 1.1008 1.1025 1.1014 1.1036 1.1038 1.0876 1.0924 1.0969 1.0954 1.0814 1.0641
irintensity: 0.5990 0.4663 1.1216 0.2518 1.2187 0.4892 8.0080 1.3648 1.5667 0.9521 0.6598 11.0481 3.3947 3.5375 2.1147 1.0109 0.0564 0.2162 1.1732 0.2232 0.2575 1.3340 4.0567 12.1803 2.7477 0.2248 2.7670 22.4027 3.5528 2.1707 7.5031 106.0467 47.7710 1.2710 3.5327 21.5329 52.6767 11.7103 3.6917 24.5511 12.5594 5.9167 42.6489 22.3816 3.3272 8.1666 0.8765 0.9284 4.1944 30.5107 19.3470 9.5989 62.8928 7.3724 4.0973 13.1518 6.0220 4.5066 3.5991 10.1675 3.8935 249.8826 17.2842 5.1623 8.8894 3.6562 14.2859 32.7758 8.0647 29.7843 111.5190 22.6321 11.4379 124.7704 6.2221 2.8936 7.7790 45.2114 3.9360 13.5113 6.5485 19.2485 8.1463 0.6967 14.3940 68.5407 10.1406 24.9110 20.0501 40.8007 259.5196 15.1149 9.4067 9.1267 2.2917 27.2244 33.8279 3.1739 0.5680 17.5765 27.2233 30.0030 7.3865 24.7146 0.9289 510.6230 160.2787 241.2474 167.4018 32.3866 30.8431 31.0075 16.7835 11.9723 51.9225 2.8830 39.1255 108.3383 65.1876 21.9364 38.9984 15.9372 12.3800 21.0580 24.6837 49.3267 7.2210 13.8120 6.8352 11.6589 162.3252 67.2604
temp: 298.150 k
press: 1.00000 atm
elementType: 35 8 8 8 7 6 6 6 6 6 6 6 6 6 6 6 6 6 6 6 6 6 6 6 1 1 1 1 1 1 1 1 1 1 1 1 1 1 1 1 1 1 1 1 1 1
symmnumber: 1
zpe: 987512.5 jmol-1
zpe.correction: 0.376124 hartree
zpe.thermalcorrener: 0.396781 hartree
zpe.thermalcorrenthalpy: 0.397725 hartree
zpe.thermalcorrgfe: 0.324532 hartree
zpe.sumelectzpe: -1029.405545 hartree
zpe.sumelectthermal: -1029.384888 hartree
zpe.sumelectthermalent: -1029.383944 hartree
zpe.sumelectthermalfe: -1029.457137 hartree
dipole: -0.4659 -0.8275 1.9502
dipole: 2.1691
quadrupole: -131.1059 -160.8548 -144.8774
quadrupole: -14.5961 4.6760 3.7352
quadrupole: 14.5068 -15.2421 0.7353 -14.5961 4.6760 3.7352
hfenergy: -1029.7816691 hartree
pointgroup: C01 [X(C19H22Br1N1O3)]
dipole: -0.0986271 0.054407 -0.8459389 debye
polarizability: 281.965707|22.2084868|240.733674|-34.0990593|6.722522|188.3357624 unknown
InChI: InChI=1S/C19H22BrNO3/c20-19-8-12-5-13(9-19)7-18(6-12,11-19)10-16(22)21-15-4-2-1-3-14(15)17(23)24/h1-4,12-13,21,23H,5-11H2
charge 0 multiplicity 1
46 atoms
Br 2.05153 -2.767324 2.140071
O  -0.485501 2.627839 -0.123739
O  -4.130767 -2.725496 -1.088228
O  -2.095797 -1.837643 -1.715347
N  -1.448674 0.577402 -0.77764
C  1.993309 0.579102 -0.68885
C  2.720152 -1.164051 0.989071
C  4.315575 -0.479031 -0.814054
C  3.759065 1.114824 1.069292
C  1.518775 -0.628911 0.188619
C  3.126097 0.083172 -1.637652
C  2.573387 1.682357 0.243407
C  3.823912 -1.682586 0.050583
C  3.266304 -0.084176 1.940383
C  4.880243 0.629032 0.112974
C  0.812773 1.119798 -1.560623
C  -0.422867 1.530061 -0.75694
C  -2.692628 0.598286 -0.114106
C  -3.57226 -0.538339 -0.25143
C  -3.109941 1.696979 0.689212
C  -4.830114 -0.537014 0.413276
C  -4.360409 1.666284 1.33313
C  -3.181616 -1.70336 -1.065567
C  -5.229165 0.55353 1.201842
H  5.105625 -0.836425 -1.502606
H  4.149512 1.902412 1.742127
H  0.722446 -0.310141 0.885891
H  1.101241 -1.428451 -0.453613
H  2.732157 -0.700775 -2.316494
H  3.470949 0.923513 -2.273378
H  2.91761 2.538273 -0.37095
H  1.782358 2.071309 0.910401
H  3.429777 -2.48819 -0.596062
H  4.660462 -2.101038 0.639893
H  4.098803 -0.492723 2.542335
H  2.474341 0.245857 2.637625
H  5.738686 0.238377 0.694552
H  5.254215 1.477538 -0.493473
H  0.548364 0.351714 -2.313575
H  1.165007 2.018792 -2.100226
H  -1.28917 -0.289155 -1.325331
H  -2.439927 2.5521 0.790295
H  -5.476878 -1.410262 0.295461
H  -4.660818 2.522745 1.947112
H  -6.198594 0.542299 1.709342
H  -3.781647 -3.469606 -1.648411
