program: Gaussian 09
title: 000039656
version: EM64L-G09RevD.01
frameworkgroup: C1[X(C7H5Cl3O)]
method: RPBEPBE
basis: SDD
operation: Freq
keyword: #p
keyword: freq=noraman
keyword: PBEPBE/SDD
title: #p freq=noraman PBEPBE/SDD
converged: NO YES NO NO
title: Mulliken charges:
elementType: Cl Cl Cl O C C C C C C C H H H H H
charge: 0.028030 -0.009509 -0.002151 -0.267342 0.563389 -0.216255 -0.287646 -0.092468 -0.214441 -0.227579 -0.513814 0.264692 0.265990 0.231901 0.245311 0.231891
chargesum: 0.00000
title: Mulliken charges with hydrogens summed into heavy atoms:
elementType: Cl Cl Cl O C C C C C C C
charge: 0.028030 -0.009509 -0.002151 -0.267342 0.563389 -0.216255 -0.287646 -0.092468 0.050251 0.038410 0.195290
polarizability: 1.51037860e+02 -1.14251631e+00 1.20186902e+02 -9.63657465e-01 -2.78774467e+00 4.61561487e+01
1716.lowfreq: -9.3039 -4.7311 -0.0014 -0.0007 0.0024 6.7962 38.4108 75.4378 94.0182
frequency: 38.2401 75.4190 94.0177 145.0013 168.3253 188.0111 195.0846 260.7799 281.3030 314.5387 327.7781 385.6530 464.1849 519.5405 545.1140 587.2190 594.8198 741.6239 755.0970 797.4431 816.9387 932.8811 958.3716 1053.3599 1107.2313 1124.6403 1150.6632 1165.9399 1220.4409 1338.4458 1366.2293 1412.5965 1443.7226 1463.5571 1465.1182 1550.5794 1569.3065 2978.4961 3075.8975 3136.1026 3168.8333 3187.1774
redmass: 2.9298 6.7054 10.6959 1.0645 4.6866 23.7136 15.7854 10.1146 7.5132 25.9974 5.8494 9.2733 6.4015 4.7491 7.3637 10.2880 5.1786 8.6732 9.0637 1.3350 7.4462 1.3312 9.6208 8.6045 1.2316 1.8043 1.3396 1.8073 2.8003 8.7592 4.3751 2.2275 1.3700 1.0527 1.0530 7.5889 8.4608 1.0306 1.1056 1.1018 1.0886 1.0977
irintensity: 5.9337 1.3640 0.6993 0.2142 5.5906 0.3715 0.6115 2.2347 1.2936 0.0707 5.3729 0.3393 7.4413 3.0542 4.3450 31.6032 6.7927 6.6090 45.8384 46.3507 24.7771 0.1152 122.7811 13.8435 0.0054 5.1862 5.3427 30.3864 51.6444 23.2575 71.7705 103.3155 33.4422 14.1456 10.6644 3.2716 5.7270 52.9675 25.6614 18.2206 0.1365 0.3778
temp: 298.150 k
press: 1.00000 atm
elementType: 17 17 17 8 6 6 6 6 6 6 6 1 1 1 1 1
symmnumber: 1
zpe: 264169.7 jmol-1
zpe.correction: 0.100617 hartree
zpe.thermalcorrener: 0.111879 hartree
zpe.thermalcorrenthalpy: 0.112823 hartree
zpe.thermalcorrgfe: 0.061746 hartree
zpe.sumelectzpe: -1724.312058 hartree
zpe.sumelectthermal: -1724.300796 hartree
zpe.sumelectthermalent: -1724.299852 hartree
zpe.sumelectthermalfe: -1724.350929 hartree
dipole: 0.8695 -0.9504 1.9439
dipole: 2.3320
quadrupole: -88.1421 -73.9980 -85.8040
quadrupole: 3.6197 3.2777 3.1712
quadrupole: -5.4941 8.6501 -3.1560 3.6197 3.2777 3.1712
hfenergy: -1724.4126751 hartree
pointgroup: C01 [X(C7H5Cl3O1)]
dipole: 0.2307694 -0.4537351 0.7632906 debye
dipolederiv: -0.077475 0.1220705 -0.0168919 0.150591 -0.6266784 0.0571506 -0.0159722 0.0364885 -0.0145567 -0.6887701 0.2340785 0.0386609 0.206161 -0.1775545 -0.0149375 0.017896 -0.0118598 -0.0398957 -0.7459858 0.1199842 0.0221735 0.1577838 -0.0942491 -0.003133 0.0365569 -0.0029747 -0.0299411 -0.9076013 -0.4755378 -0.1730355 -0.5278797 -0.7816937 -0.1670428 -0.0787163 -0.0710887 -0.3650271 0.5017403 0.5807127 0.047512 0.5414699 0.361645 0.0531941 -0.1225362 -0.1073131 0.03761 -0.2137875 -0.326536 0.0181904 -0.1012227 0.8569395 -0.108814 0.0091719 -0.0567738 -0.0525964 0.9363201 -0.3434089 -0.0848421 -0.4286472 0.1045588 -0.0038093 -0.0386705 0.00124 -0.0859988 1.054496 -0.0971826 -0.056559 -0.2977903 -0.0397335 0.0158473 -0.0511528 0.0021462 -0.0354835 -0.1705316 0.0345952 0.0050136 0.0765487 -0.0158233 -0.0196716 -0.0059861 -0.0111517 -0.0893644 -0.2268161 0.0160643 0.0000825 0.0695503 -0.0410713 -0.0140944 0.0020591 -0.0064391 -0.1110652 0.4562519 0.1506314 0.1485354 0.1776927 0.4309799 0.1437051 0.316967 0.267244 0.4396025 0.0734585 0.0377543 0.0014149 0.026684 -0.0117022 0.0115072 0.00469 0.0132994 0.1687099 0.0186148 -0.0484706 0.0135805 -0.0420261 0.0395912 0.0136519 0.012262 0.0138261 0.1690289 -0.0222613 0.0956506 0.0956709 0.0238031 0.0197759 -0.0824603 -0.0115656 -0.1050294 -0.0220327 -0.0123489 -0.12039 0.0191914 -0.1245477 0.0037624 0.0182333 0.0397246 0.0397127 0.0589709 0.0246962 0.019984 -0.0786975 0.0918291 -0.0287467 0.1006731 -0.1147277 -0.0013266 -0.0279607 unknown
polarizability: 148.3047115|-8.8359106|122.9381038|-1.6454451|-2.1653304|46.1380952 unknown
InChI: InChI=1S/C7H5Cl3O/c1-11-7-5(9)3-2-4(8)6(7)10/h2-3H,1H3
charge 0 multiplicity 1
16 atoms
Cl -1.078727 2.440567 -0.225897
Cl 2.697327 -1.631884 -0.131542
Cl -3.455063 0.207998 0.130993
O  1.673708 1.220207 -0.414884
C  0.670332 0.283869 -0.164406
C  -0.694339 0.681867 -0.096384
C  0.965219 -1.099028 -0.05708
C  -1.713039 -0.282849 0.054276
C  -0.047224 -2.064403 0.091482
C  -1.395426 -1.653176 0.147184
C  2.290858 1.835646 0.784246
H  0.210356 -3.124278 0.162159
H  -2.195971 -2.388836 0.259073
H  1.530623 2.374808 1.378757
H  3.033917 2.54386 0.390899
H  2.78915 1.065131 1.400823
