program: Gaussian 09
title: 000039651
version: EM64L-G09RevD.01
frameworkgroup: C1[X(C14H21N3O)]
method: RPBEPBE
basis: SDD
operation: Freq
keyword: #p
keyword: freq=noraman
keyword: PBEPBE/SDD
title: #p freq=noraman PBEPBE/SDD
converged: YES YES NO NO
title: Mulliken charges:
elementType: O N N N C C C C C C C C C C C C C C H H H H H H H H H H H H H H H H H H H H H
charge: -0.279764 -0.360630 -0.351352 -0.087033 -0.188640 -0.527336 0.314311 -0.524137 0.253150 0.162680 -0.406148 -0.375254 -0.385388 -0.326667 -0.244077 -0.245241 -0.616624 -0.613208 0.225645 0.250694 0.179036 0.198778 0.235207 0.312881 0.228466 0.229034 0.308037 0.231574 0.250891 0.218584 0.196398 0.226117 0.226580 0.223806 0.191481 0.222991 0.229595 0.220179 0.195385
chargesum: 0.00000
title: Mulliken charges with hydrogens summed into heavy atoms:
elementType: O N N N C C C C C C C C C C C C C C
charge: -0.279764 -0.047750 -0.043316 -0.087033 0.037005 -0.097605 0.314311 -0.090152 0.253150 0.162680 -0.177682 -0.146220 0.097077 0.088316 -0.017960 -0.018661 0.021655 0.031950
polarizability: 2.31416476e+02 -2.68854293e+00 1.72980179e+02 5.96932192e+00 1.09423062e+01 1.10773594e+02
1716.lowfreq: -13.5861 -4.7971 -0.6605 -0.0006 -0.0004 0.0001 14.3204 22.0448 28.6969
frequency: 13.7026 21.6032 28.5643 50.6245 71.4213 97.0508 111.2580 138.2707 179.2215 196.1676 214.4144 228.3426 257.2195 262.5648 275.4835 308.8598 345.3273 362.1983 407.8117 427.8470 430.5566 447.6093 454.0647 500.6811 520.0474 565.1635 579.1485 591.4771 628.7768 689.1553 714.2366 731.3428 742.3018 753.7987 804.8082 820.6191 844.4984 865.5075 903.0133 916.7045 944.7302 983.4888 992.5582 1018.3184 1024.5168 1033.7179 1037.1512 1052.9599 1069.7122 1074.6748 1089.1905 1090.2365 1113.3448 1139.6985 1166.7098 1172.9777 1182.0963 1195.3572 1200.9122 1214.0678 1230.6379 1241.5762 1246.3929 1255.1792 1267.6664 1292.6748 1302.1788 1305.7916 1323.1491 1335.2502 1354.4634 1380.2941 1387.3422 1419.4357 1434.6389 1440.1222 1441.4967 1442.9245 1449.8910 1461.3649 1465.9915 1467.8432 1475.8617 1479.4737 1487.0721 1490.3981 1498.9582 1592.1482 1607.3460 1616.6533 2799.2594 2818.1450 2855.7990 2866.2461 2881.4319 2955.2376 3013.8428 3015.4367 3017.9917 3020.0148 3023.2209 3032.9622 3076.0584 3089.0549 3096.8128 3109.1239 3113.2805 3135.9319 3158.6631 3463.5291 3557.4976
redmass: 3.0181 3.7989 4.0767 4.9415 4.2416 2.2165 3.4998 3.3678 2.5924 2.4135 1.1224 1.4952 2.6378 2.7515 3.4343 5.2917 2.4712 3.5342 2.8631 2.5802 2.5973 3.1816 3.5618 3.6720 3.7661 1.3920 3.1177 4.1837 2.0182 2.5853 3.1839 2.2045 2.5460 1.4561 1.9180 4.3351 2.9340 1.3380 2.9398 2.2824 1.6117 1.3209 1.9690 2.7498 2.5412 1.5843 2.3491 2.8944 2.5148 1.9387 1.3554 2.6508 1.7786 1.5170 2.1090 1.0689 1.6878 1.2901 2.2917 1.2123 2.2147 2.0634 1.3730 1.6183 2.3946 1.6335 1.4149 1.1637 1.4335 1.3612 1.6505 1.3233 5.0981 1.1408 1.3064 1.9567 1.1541 1.3065 1.1104 1.0594 1.1789 1.0581 1.0533 1.0924 1.0589 2.2686 1.9180 6.7430 6.9766 6.4446 1.0785 1.0711 1.0567 1.0599 1.0651 1.0603 1.0857 1.0894 1.0734 1.0992 1.0603 1.0738 1.1010 1.1013 1.1031 1.0867 1.0892 1.0924 1.1004 1.0752 1.0773
irintensity: 0.3443 0.4021 0.4332 5.6515 1.6544 0.5451 2.7682 0.0195 1.0370 3.2782 0.3999 1.0168 10.3745 1.7657 4.8020 7.0627 9.6975 11.7402 2.1228 3.0276 7.5194 8.6514 6.0065 3.4289 12.7443 92.6569 20.8139 12.3643 54.0956 32.6064 11.5943 24.2537 35.3786 40.0659 5.8748 12.2151 6.5422 0.3837 6.8195 1.9828 0.2526 0.0048 1.9188 8.8128 18.3734 21.6627 6.1453 23.4590 21.8692 3.3246 7.5458 2.6655 5.4185 6.1536 2.5455 0.1628 9.4635 22.3660 2.1012 16.9746 0.9805 48.0164 15.7692 51.1828 2.6783 14.8493 23.0967 2.0220 2.1405 8.9189 7.0667 6.9598 4.4690 3.5837 77.0317 12.3991 0.9206 3.4250 9.6888 28.4811 10.9159 5.8965 11.2988 18.2699 10.3085 31.3777 225.6159 6.1035 146.7780 2.6415 67.8294 123.4638 81.3214 90.5969 137.7622 54.0122 29.8308 23.5088 51.0958 20.0597 27.3922 55.5836 33.1962 43.5290 15.4358 17.5545 2.0923 28.3201 35.6164 33.6064 12.9584
temp: 298.150 k
press: 1.00000 atm
elementType: 8 7 7 7 6 6 6 6 6 6 6 6 6 6 6 6 6 6 1 1 1 1 1 1 1 1 1 1 1 1 1 1 1 1 1 1 1 1 1
symmnumber: 1
zpe: 870831.4 jmol-1
zpe.correction: 0.331682 hartree
zpe.thermalcorrener: 0.349848 hartree
zpe.thermalcorrenthalpy: 0.350792 hartree
zpe.thermalcorrgfe: 0.282687 hartree
zpe.sumelectzpe: -784.181958 hartree
zpe.sumelectthermal: -784.163792 hartree
zpe.sumelectthermalent: -784.162848 hartree
zpe.sumelectthermalfe: -784.230953 hartree
dipole: 0.0211 2.4371 0.8884
dipole: 2.5941
quadrupole: -98.9851 -105.5905 -111.7298
quadrupole: 6.1250 -2.9435 1.4344
quadrupole: 6.4500 -0.1553 -6.2947 6.1250 -2.9435 1.4344
hfenergy: -784.51364 hartree
pointgroup: C01 [X(C14H21N3O1)]
dipole: -0.0108049 -0.9132974 0.4553809 debye
polarizability: 231.6658701|-2.3605015|169.6782682|-2.6679661|-17.7504017|113.8261102 unknown
InChI: InChI=1S/C14H21N3O/c1-17(2)8-7-15-14(18)13-9-11-5-3-4-6-12(11)10-16-13/h3-6,13,15-16H,7-10H2,1-2H3
charge 0 multiplicity 1
39 atoms
O  -1.559529 2.024903 -0.0638
N  1.078603 1.595848 -0.614954
N  -1.773945 -0.019872 1.019459
N  -5.36448 -0.688342 -0.064956
C  0.507237 0.829712 0.498252
C  1.041667 -0.619136 0.398591
C  2.563256 -0.625129 0.256524
C  2.520136 1.829674 -0.49169
C  3.263365 0.532039 -0.18227
C  -1.027525 0.986654 0.442651
C  3.296055 -1.800433 0.56178
C  4.673928 0.485415 -0.303943
C  -3.245357 0.026578 1.067031
C  -3.8862 -0.705147 -0.138595
C  4.69998 -1.842409 0.431497
C  5.394778 -0.689736 -0.005307
C  -5.9837 -1.763159 -0.868214
C  -5.945831 0.633842 -0.385442
H  0.820043 1.239955 1.497927
H  0.583276 -1.098983 -0.488266
H  0.768482 -1.216892 1.293562
H  2.778101 2.569648 0.312367
H  2.895712 2.25146 -1.44307
H  0.50388 2.415007 -0.850365
H  2.755736 -2.692032 0.905622
H  5.211138 1.381107 -0.641779
H  -1.2966 -0.853014 1.365435
H  -3.604169 -0.434765 2.00417
H  -3.531373 1.091281 1.066061
H  -3.497004 -0.246295 -1.081627
H  -3.556472 -1.762114 -0.127946
H  5.247942 -2.760884 0.669675
H  6.485128 -0.708853 -0.111886
H  -5.594235 -2.744939 -0.544488
H  -5.799581 -1.662135 -1.968027
H  -7.076898 -1.760873 -0.707232
H  -5.545506 1.408732 0.289336
H  -7.040506 0.597136 -0.242625
H  -5.740532 0.956157 -1.43736
