program: Gaussian 09
title: 000039653
version: EM64L-G09RevD.01
frameworkgroup: C1[X(C14H20N2O2)]
method: RPBEPBE
basis: SDD
operation: Freq
keyword: #p
keyword: freq=noraman
keyword: PBEPBE/SDD
title: #p freq=noraman PBEPBE/SDD
converged: YES YES NO NO
title: Mulliken charges:
elementType: O O N N C C C C C C C C C C C C C C H H H H H H H H H H H H H H H H H H H H
charge: -0.274431 -0.237048 -0.315825 -0.089818 -0.362797 0.270414 -0.499817 0.275359 -0.452245 0.231013 -0.369085 -0.381454 -0.248638 -0.246405 -0.280137 -0.352655 -0.612988 -0.613489 0.275314 0.209107 0.235055 0.236456 0.209986 0.272285 0.257363 0.231915 0.225592 0.225886 0.237531 0.241729 0.192903 0.223411 0.228511 0.223962 0.190198 0.190058 0.225213 0.227569
chargesum: 0.00000
title: Mulliken charges with hydrogens summed into heavy atoms:
elementType: O O N N C C C C C C C C C C C C C C
charge: -0.274431 -0.237048 -0.043540 -0.089818 -0.087482 0.270414 -0.055655 0.275359 -0.005803 0.231013 -0.111722 -0.149538 -0.023046 -0.020519 0.199123 0.063659 0.029683 0.029351
polarizability: 2.08869987e+02 -4.83310916e+00 1.81052841e+02 -1.35573061e+01 -6.89757452e-01 1.15563099e+02
1716.lowfreq: -20.6265 -7.1428 -0.7722 0.0006 0.0006 0.0008 4.9937 15.8708 30.4364
frequency: -18.9228 13.9654 30.3144 45.5152 77.4791 79.5663 89.3714 147.0289 174.9528 184.9249 215.2606 220.2714 231.5966 256.4514 292.6626 326.1942 341.3580 351.8810 368.8209 423.1130 432.0651 444.6596 457.8665 490.0868 512.8293 564.6957 584.5651 658.8245 694.9782 699.4183 724.9048 755.1954 776.7905 804.3371 814.4621 832.4638 863.8964 882.4079 906.7238 909.2149 949.4307 959.6992 987.8103 1031.5848 1033.9964 1035.2807 1038.6032 1064.0422 1067.3839 1082.6197 1089.8813 1093.2036 1118.0677 1138.9315 1155.5547 1173.5752 1178.8201 1191.6438 1198.7796 1214.1667 1227.9656 1236.8571 1249.7499 1265.3470 1271.2657 1285.7652 1303.0600 1323.4683 1337.6986 1369.7866 1381.3522 1383.7085 1419.0332 1437.7952 1441.7389 1444.2006 1456.4770 1461.4636 1465.7788 1474.1707 1476.0718 1483.3717 1486.8758 1489.0693 1489.9495 1591.0291 1613.0186 1630.5078 2852.6240 2856.5578 2873.8525 2947.7997 2976.9185 3002.3517 3022.2993 3026.0702 3032.9693 3034.7301 3040.1752 3050.3975 3080.8128 3088.1549 3102.4804 3114.0274 3129.1716 3143.4071 3161.0040 3476.7000
redmass: 2.5652 4.2937 7.0724 4.3182 2.5771 3.9107 2.9380 3.1052 3.3744 2.5885 1.2599 1.4949 2.4757 2.7084 4.0371 2.7918 2.5211 3.6858 3.4431 3.5366 2.6432 2.9718 3.2896 3.1723 4.1761 2.2813 4.7280 6.7832 2.1050 4.1631 3.8927 1.6230 2.7549 1.2989 3.6133 2.6457 3.9426 1.6374 2.6560 4.5398 2.3275 1.6805 1.3237 2.2653 1.5574 2.2357 2.3964 2.0387 1.6571 2.2556 2.2582 2.0464 1.7577 1.5042 2.9878 1.0775 1.4898 1.4962 1.1711 1.6512 2.7013 1.6821 1.5302 2.5113 1.3041 1.2192 1.2575 1.3697 1.5803 1.4628 1.4317 6.4604 1.1429 1.7950 1.2958 1.1684 1.3358 1.0480 1.0704 1.0666 1.0565 1.0611 1.5908 1.1045 1.3699 6.8228 6.5981 9.2885 1.0569 1.0641 1.0631 1.0681 1.0603 1.0839 1.0727 1.0594 1.0704 1.0983 1.0880 1.0964 1.1012 1.1011 1.1083 1.0869 1.0879 1.0938 1.1006 1.0751
irintensity: 0.4087 0.0158 1.4863 0.0817 1.3921 0.1458 0.6513 0.7659 3.8496 0.7421 0.8885 0.6716 4.4141 10.4167 9.2899 5.9808 12.9754 13.2115 1.6493 10.4242 16.5863 1.8775 7.2399 9.8351 2.2563 74.5911 13.6220 7.2306 40.8309 70.0443 8.6780 26.9258 19.4769 4.9062 12.7695 13.1885 3.8363 3.2052 7.4834 26.5546 39.6422 12.5185 0.7376 72.7527 17.3871 1.6206 10.2540 22.0724 1.7190 67.6000 288.5706 53.8739 19.2786 3.4077 11.8209 0.2120 2.0852 4.6182 1.0026 1.4187 1.7470 8.2491 15.0258 9.5324 13.2670 1.7700 4.6360 5.6585 7.0480 3.3715 8.4218 0.2926 1.7786 0.7593 18.1084 2.9132 9.5616 11.9887 6.5864 12.2875 13.6415 10.8581 8.2148 26.8165 23.3369 2.6562 9.2394 157.1588 68.5614 76.5787 201.1375 48.7232 27.4236 13.3803 42.7889 5.7931 58.3724 35.1156 11.8459 50.3741 25.3206 50.7389 22.1272 8.6161 6.9461 25.4775 28.1686 1.1023
temp: 298.150 k
press: 1.00000 atm
elementType: 8 8 7 7 6 6 6 6 6 6 6 6 6 6 6 6 6 6 1 1 1 1 1 1 1 1 1 1 1 1 1 1 1 1 1 1 1 1
symmnumber: 1
zpe: 837345.7 jmol-1
zpe.correction: 0.318928 hartree
zpe.thermalcorrener: 0.336217 hartree
zpe.thermalcorrenthalpy: 0.337161 hartree
zpe.thermalcorrgfe: 0.271852 hartree
zpe.sumelectzpe: -804.042998 hartree
zpe.sumelectthermal: -804.025709 hartree
zpe.sumelectthermalent: -804.024765 hartree
zpe.sumelectthermalfe: -804.090074 hartree
dipole: -1.7291 0.2036 0.9121
dipole: 1.9655
quadrupole: -90.9014 -102.7409 -112.8521
quadrupole: -0.8765 -7.3743 -2.2256
quadrupole: 11.2634 -0.5761 -10.6873 -0.8765 -7.3743 -2.2256
hfenergy: -804.3619259 hartree
pointgroup: C01 [X(C14H20N2O2)]
dipole: 0.6813027 0.1001001 -0.3518318 debye
polarizability: 208.3718018|6.2176304|180.3469727|-10.7054697|-12.0823183|116.7671525 unknown
InChI: InChI=1S/C14H20N2O2/c1-16(2)9-10-18-14(17)13-12-6-4-3-5-11(12)7-8-15-13/h3-6,13,15H,7-10H2,1-2H3
charge 0 multiplicity 1
38 atoms
O  1.361294 -0.169395 -0.257058
O  0.647836 -1.798303 1.257829
N  -1.389847 -2.578818 -0.681389
N  4.923674 0.876524 0.32538
C  -0.751858 -1.261138 -0.753516
C  -1.756661 -0.12578 -0.487061
C  -3.495714 -1.831279 0.318614
C  -3.04886 -0.403372 0.036653
C  -2.296183 -2.780639 0.474455
C  0.45931 -1.125401 0.219443
C  -1.387512 1.212082 -0.776089
C  -3.939059 0.677502 0.265129
C  -2.284983 2.2757 -0.550607
C  -3.57021 2.007229 -0.023344
C  2.569051 0.119584 0.575264
C  3.701948 0.462731 -0.401656
C  5.829643 1.689836 -0.512092
C  5.63237 -0.251893 0.96635
H  -0.33657 -1.116856 -1.769091
H  -4.126764 -1.859685 1.227617
H  -4.118812 -2.184805 -0.526589
H  -1.788323 -2.60293 1.447393
H  -2.639423 -3.830404 0.457159
H  -0.715592 -3.343963 -0.797825
H  -0.386627 1.413912 -1.173126
H  -4.935066 0.464228 0.673599
H  -1.986245 3.303812 -0.783384
H  -4.274516 2.826313 0.16086
H  2.337227 0.981515 1.223747
H  2.779981 -0.763366 1.20234
H  3.877961 -0.408455 -1.082354
H  3.370435 1.307095 -1.033078
H  5.291534 2.575557 -0.89343
H  6.678105 2.044311 0.100145
H  6.248304 1.132566 -1.388397
H  6.014538 -1.00301 0.228591
H  6.493207 0.134401 1.539935
H  4.968004 -0.775807 1.674381
