program: Gaussian 09
title: 000039647
version: EM64L-G09RevD.01
frameworkgroup: C1[X(C17H22N2O)]
method: RPBEPBE
basis: SDD
operation: Freq
keyword: #p
keyword: freq=noraman
keyword: PBEPBE/SDD
title: #p freq=noraman PBEPBE/SDD
converged: YES YES NO NO
title: Mulliken charges:
elementType: O N N C C C C C C C C C C C C C C C C C H H H H H H H H H H H H H H H H H H H H H H
charge: -0.285208 -0.102017 -0.376991 -0.353115 -0.396519 -0.331250 -0.326334 -0.674163 -0.671793 0.286743 0.157627 0.365512 0.395311 -0.554782 -0.374102 -0.436437 -0.409256 -0.409328 -0.240356 -0.236961 0.193990 0.252802 0.260680 0.211941 0.200596 0.189282 0.199916 0.188818 0.300555 0.236186 0.221886 0.200868 0.210147 0.225882 0.204517 0.282836 0.209736 0.236858 0.246057 0.239672 0.230649 0.229548
chargesum: 0.00000
title: Mulliken charges with hydrogens summed into heavy atoms:
elementType: O N N C C C C C C C C C C C C C C C C C
charge: -0.285208 -0.102017 -0.076435 0.093677 0.076101 0.058628 0.062399 -0.015224 -0.031247 0.286743 0.157627 0.365512 0.395311 -0.271946 -0.164366 -0.199580 -0.163199 -0.169657 -0.009707 -0.007413
polarizability: 3.36786041e+02 1.61575463e+01 1.98018393e+02 9.64878917e+00 -1.12154761e+01 1.16320485e+02
1716.lowfreq: -3.3893 -0.0010 0.0005 0.0007 2.5323 4.8755 10.5909 24.9655 28.6479
frequency: 8.0841 24.5010 28.0578 34.1502 60.6486 70.0824 90.5937 94.7408 135.0248 150.5307 182.1486 195.2110 219.6050 241.2701 268.5203 281.0420 288.7842 306.5714 344.0038 385.6181 397.4704 403.7718 448.5646 465.1510 483.0403 506.1540 510.1379 518.0109 530.3333 587.6157 629.7408 634.2559 719.0809 733.8873 748.6802 759.6377 769.0917 790.5700 793.0406 796.1613 810.6242 825.1389 866.1816 881.7132 917.0095 938.2854 946.3889 960.6158 978.0382 987.1543 995.3152 1011.7501 1023.3584 1044.7282 1070.8061 1076.7882 1078.8452 1086.1400 1117.8557 1122.5359 1144.3834 1165.3545 1174.0915 1180.4860 1211.4347 1217.1879 1237.9643 1253.8806 1273.9409 1282.1260 1290.5215 1291.4506 1298.3720 1325.9179 1349.7097 1360.0710 1365.9268 1375.5594 1387.1100 1391.9971 1409.9405 1423.6381 1432.8057 1441.4287 1458.5256 1461.5432 1463.5974 1469.7052 1479.0526 1486.6485 1487.6735 1489.4487 1492.6548 1512.0245 1570.1486 1592.8239 1604.0467 1640.8440 2846.3764 2859.1750 2897.6110 2981.4386 2982.6116 3009.8564 3016.7473 3030.8211 3056.5846 3074.8033 3076.1313 3088.5582 3089.3012 3091.0911 3113.6375 3122.1173 3129.7239 3139.2841 3144.3749 3145.3154 3163.8580 3568.3369
redmass: 3.5944 5.0216 4.1131 3.9274 3.4831 2.8309 4.1886 2.2645 3.1331 1.9981 3.7016 2.0128 1.5889 1.7964 2.9869 2.4897 2.3508 3.0445 5.3302 2.9609 3.1007 3.6767 2.7407 2.9760 2.5243 2.9820 2.7630 2.6740 2.7278 5.7699 4.8013 4.4713 2.3538 1.7455 2.6123 4.3309 1.6932 2.7174 1.3292 1.1911 1.7983 1.4613 3.6434 1.6072 2.0062 4.0718 1.4457 1.4656 1.4398 2.3098 1.3550 3.6815 2.3239 3.0267 1.9803 2.3614 2.2993 1.9139 2.0771 1.7492 1.8642 1.2828 1.0880 1.6665 2.2437 1.8392 1.9824 1.3883 1.7226 1.4857 1.4765 1.3284 1.1410 1.2691 1.8627 1.3460 1.3307 1.3289 1.2384 1.2285 5.4725 2.8559 3.7280 1.2048 2.0668 1.0750 1.0596 1.0635 1.0628 1.0600 1.1410 1.6885 1.1405 3.5500 6.9218 7.1022 5.7731 6.9363 1.0714 1.0715 1.0708 1.0358 1.0358 1.0874 1.0601 1.0874 1.0894 1.0989 1.0984 1.1050 1.1006 1.1005 1.0865 1.0861 1.0885 1.0962 1.0931 1.0947 1.1005 1.0777
irintensity: 0.4717 1.2819 0.6559 1.2543 3.4910 1.7413 2.0170 0.4340 2.0980 2.8065 1.5061 2.0149 0.5454 0.6403 4.6522 0.3294 0.8931 3.9137 5.8682 2.0941 0.6110 16.4031 3.1702 7.5594 28.6174 33.1312 13.5405 26.5280 36.2438 2.0274 1.6711 0.9808 4.4178 4.5430 8.7869 1.5907 66.9828 1.0238 7.5999 1.8590 18.0976 50.3852 0.3257 10.5037 1.9027 1.8504 7.8965 1.9717 15.2873 2.6110 0.2010 7.3378 1.7076 2.5835 18.1403 26.3570 56.6782 7.8372 4.1438 9.9624 10.8340 1.1662 1.0184 21.4752 44.3498 102.2178 11.1297 4.6295 5.0657 62.8873 9.1349 38.1896 29.8791 2.6615 4.8736 2.6991 3.3191 5.6719 27.7191 16.8478 5.8594 2.7151 8.8802 35.8174 23.6581 4.0286 4.1342 2.4058 2.4992 8.6755 13.8714 277.5356 68.3803 4.5327 45.0315 61.6637 22.2900 3.2364 64.1045 147.9397 93.7991 30.0342 37.1245 25.7783 41.2757 29.4964 8.6308 28.0752 79.6143 18.8973 38.5260 47.2413 11.0001 2.6686 0.2401 19.2711 11.5715 24.6221 36.8461 13.8544
temp: 298.150 k
press: 1.00000 atm
elementType: 8 7 7 6 6 6 6 6 6 6 6 6 6 6 6 6 6 6 6 6 1 1 1 1 1 1 1 1 1 1 1 1 1 1 1 1 1 1 1 1 1 1
symmnumber: 1
zpe: 930064.5 jmol-1
zpe.correction: 0.354243 hartree
zpe.thermalcorrener: 0.374252 hartree
zpe.thermalcorrenthalpy: 0.375196 hartree
zpe.thermalcorrgfe: 0.301995 hartree
zpe.sumelectzpe: -844.260790 hartree
zpe.sumelectthermal: -844.240781 hartree
zpe.sumelectthermalent: -844.239837 hartree
zpe.sumelectthermalfe: -844.313038 hartree
dipole: 0.6833 -3.6906 0.5628
dipole: 3.7953
quadrupole: -99.7133 -112.2823 -124.7049
quadrupole: 3.9049 -1.6723 -0.7006
quadrupole: 12.5202 -0.0488 -12.4714 3.9049 -1.6723 -0.7006
hfenergy: -844.6150334 hartree
pointgroup: C01 [X(C17H22N2O1)]
dipole: -0.2723921 1.4306483 -0.3296438 debye
polarizability: 336.4027953|11.1464361|194.5005334|-17.5540362|-20.139239|120.2215899 unknown
InChI: InChI=1S/C17H22N2O/c1-3-19(4-2)12-11-18-17(20)16-10-9-14-7-5-6-8-15(14)13-16/h5-10,13,18H,3-4,11-12H2,1-2H3
charge 0 multiplicity 1
42 atoms
O  0.725876 -1.423088 0.242427
N  4.891265 0.150611 0.16449
N  1.237247 0.568806 -0.833064
C  3.460064 0.480457 0.344951
C  2.66543 0.228287 -0.963484
C  5.469635 -0.654287 1.271416
C  5.716414 1.314438 -0.245704
C  4.974054 -2.113468 1.260142
C  6.969943 0.918945 -1.050467
C  -1.089979 0.156018 -0.135205
C  0.34743 -0.295227 -0.214755
C  -3.45125 -0.489755 0.181666
C  -3.853599 0.895093 0.031445
C  -2.063352 -0.823159 0.098737
C  -1.493969 1.529769 -0.267959
C  -2.839563 1.885809 -0.185322
C  -4.459507 -1.485555 0.409383
C  -5.244881 1.23005 0.115258
C  -5.807897 -1.130295 0.485439
C  -6.203706 0.238347 0.336916
H  3.311279 1.536438 0.673474
H  3.022164 -0.163776 1.126764
H  2.758156 -0.841884 -1.215828
H  3.093979 0.819499 -1.792944
H  6.568838 -0.652473 1.153627
H  5.25703 -0.190364 2.26799
H  5.083283 1.96293 -0.881733
H  6.016665 1.937903 0.635714
H  0.891329 1.426418 -1.262279
H  3.874405 -2.17504 1.350839
H  5.261507 -2.603601 0.313519
H  5.415462 -2.679187 2.102222
H  7.657946 0.289423 -0.458128
H  6.678746 0.348869 -1.949962
H  7.529165 1.820636 -1.363865
H  -1.732187 -1.860551 0.222618
H  -0.744717 2.320694 -0.393813
H  -3.137179 2.937272 -0.275498
H  -4.153042 -2.531958 0.523202
H  -5.547599 2.278045 0.002669
H  -6.570718 -1.896915 0.659463
H  -7.265068 0.502925 0.398738
