program: Gaussian 09
title: 000039642
version: EM64L-G09RevD.01
frameworkgroup: C1[X(C15H18N2O)]
method: RPBEPBE
basis: SDD
operation: Freq
keyword: #p
keyword: freq=noraman
keyword: PBEPBE/SDD
title: #p freq=noraman PBEPBE/SDD
converged: YES YES NO NO
title: Mulliken charges:
elementType: O N N C C C C C C C C C C C C C C C H H H H H H H H H H H H H H H H H H
charge: -0.277785 -0.086296 -0.368436 -0.327519 -0.389274 0.193317 0.170219 0.390375 0.132927 -0.418215 -0.371287 -0.437504 -0.427834 -0.617429 -0.616261 -0.250476 -0.251447 -0.242162 0.172000 0.252297 0.261804 0.216209 0.310787 0.251023 0.288681 0.240554 0.236655 0.235609 0.186849 0.220924 0.218766 0.227082 0.187440 0.230450 0.229243 0.228714
chargesum: 0.00000
title: Mulliken charges with hydrogens summed into heavy atoms:
elementType: O N N C C C C C C C C C C C C C C C
charge: -0.277785 -0.086296 -0.057648 0.096778 0.088739 0.193317 0.170219 0.390375 0.132927 -0.167192 -0.082606 -0.196950 -0.191179 0.025953 0.017026 -0.020026 -0.022204 -0.013448
polarizability: 2.37385025e+02 -1.24888228e+01 2.09747035e+02 1.65890663e+01 6.34213143e+00 1.03155229e+02
1716.lowfreq: -15.8913 -5.4878 -1.8950 0.0003 0.0004 0.0007 12.9502 25.1289 32.6092
frequency: 4.1726 24.8072 32.5696 67.0614 83.0202 97.9676 145.2544 170.2489 181.4816 196.7612 216.2687 226.3432 254.6501 281.4511 348.6969 354.5883 389.0030 395.9709 418.3949 443.3561 473.4197 483.7361 507.1333 528.3426 550.3358 578.4891 642.1109 649.5415 717.4364 739.1981 752.4407 787.1579 791.7122 795.5791 820.9897 827.1390 855.3448 886.2727 928.7891 959.0087 968.7975 988.8828 997.6893 1019.3671 1027.7211 1033.8942 1052.0454 1068.9172 1077.7660 1081.8660 1091.1638 1137.7755 1147.3811 1166.3665 1176.2192 1182.3414 1204.5921 1235.5690 1254.8966 1265.5406 1272.6306 1284.0685 1301.8156 1327.4212 1370.5449 1373.4501 1400.8569 1414.2154 1418.9433 1434.7465 1440.2846 1446.9680 1452.0752 1461.4786 1466.2669 1474.7720 1478.9072 1481.2897 1485.8942 1515.6644 1572.6491 1587.9283 1599.2706 1631.2257 2838.3571 2844.0031 2864.1911 3016.7279 3020.3672 3024.4025 3050.5760 3077.9778 3082.6762 3095.9536 3121.7080 3123.4904 3132.7721 3136.7874 3157.0492 3158.5460 3179.1190 3554.3810
redmass: 2.6486 4.6575 4.2567 5.5783 2.6335 2.9079 4.1013 3.2890 4.1764 1.1593 3.1114 1.7624 2.1212 2.8589 2.6917 6.3570 2.8447 3.3315 2.8365 3.6287 3.2777 3.4752 5.4252 6.1572 1.1670 3.9978 3.9667 5.4301 2.7900 2.2137 1.6860 3.9601 2.1597 2.0731 1.6506 3.9683 3.0485 1.7244 1.4617 3.8995 1.4233 1.3848 1.3475 3.0505 2.5124 1.5557 2.5828 2.5130 1.8214 2.5374 1.3831 1.4889 1.5866 1.4551 1.1402 1.5937 1.6791 1.8380 1.8413 2.2393 1.8004 1.9498 1.1409 1.3065 2.4593 1.3583 2.5802 5.8252 1.1457 1.9174 1.2763 1.2191 2.3427 1.0494 1.0771 1.0549 1.1002 1.6187 1.1105 3.8903 6.3602 7.1028 5.6051 6.6515 1.0682 1.0581 1.0588 1.0635 1.0727 1.0702 1.0871 1.1006 1.1005 1.1033 1.0865 1.0859 1.0914 1.0905 1.0977 1.0987 1.0962 1.0779
irintensity: 0.3004 0.5262 0.8794 6.0779 0.0958 2.8330 4.0039 0.1022 2.0122 1.7212 1.8485 0.3574 0.5403 8.5043 9.1857 3.7668 4.7326 2.4908 1.8385 10.2206 0.9510 19.7584 14.5033 5.1076 78.2644 11.3367 1.4373 5.7041 0.5589 2.4190 3.0283 3.7581 14.4740 88.7710 53.3329 5.2101 3.1168 3.6294 1.4595 2.5331 2.0010 2.7162 0.4146 14.4782 15.6776 20.8190 13.9897 38.4164 12.8840 6.2036 11.8720 3.2808 1.9724 7.5631 12.1666 12.0412 26.8456 7.4273 44.1638 7.4981 26.9713 64.3177 9.0191 2.5327 6.7016 1.4053 2.7675 0.8835 9.4184 43.6043 2.5832 15.2773 0.0488 15.9188 26.0670 31.5249 23.0382 145.9758 68.2724 44.3973 69.0338 29.3962 23.0375 3.2599 57.2854 90.4900 227.7024 15.5469 38.4240 76.0165 9.0620 22.4814 56.4485 14.2892 1.0446 0.1067 15.3271 22.8933 39.2984 19.2589 12.7953 16.6002
temp: 298.150 k
press: 1.00000 atm
elementType: 8 7 7 6 6 6 6 6 6 6 6 6 6 6 6 6 6 6 1 1 1 1 1 1 1 1 1 1 1 1 1 1 1 1 1 1
symmnumber: 1
zpe: 783299.7 jmol-1
zpe.correction: 0.298343 hartree
zpe.thermalcorrener: 0.315590 hartree
zpe.thermalcorrenthalpy: 0.316534 hartree
zpe.thermalcorrgfe: 0.249728 hartree
zpe.sumelectzpe: -765.808804 hartree
zpe.sumelectthermal: -765.791557 hartree
zpe.sumelectthermalent: -765.790613 hartree
zpe.sumelectthermalfe: -765.857419 hartree
dipole: 0.1915 -2.0234 -3.5522
dipole: 4.0925
quadrupole: -90.1057 -93.6992 -116.8113
quadrupole: -1.2314 -2.3192 -0.0451
quadrupole: 10.0997 6.5062 -16.6059 -1.2314 -2.3192 -0.0451
hfenergy: -766.1071473 hartree
pointgroup: C01 [X(C15H18N2O1)]
dipole: 0.0142768 -0.4311163 -1.5512637 debye
polarizability: 235.9517398|-17.5772392|202.30425|11.9914662|30.5981742|112.031299 unknown
InChI: InChI=1S/C15H18N2O/c1-17(2)11-10-16-15(18)14-9-5-7-12-6-3-4-8-13(12)14/h3-9,16H,10-11H2,1-2H3
charge 0 multiplicity 1
36 atoms
O  0.802779 0.189244 1.581745
N  4.97735 0.219691 -0.107494
N  1.411539 -1.122422 -0.23546
C  3.528222 0.215418 -0.400746
C  2.845746 -1.084853 0.096936
C  -1.914959 0.436074 0.162466
C  -0.965716 -0.655004 0.094692
C  -3.274354 0.200491 -0.291112
C  0.464334 -0.479548 0.552046
C  -1.382465 -1.913092 -0.372208
C  -1.572381 1.74739 0.638894
C  -3.651321 -1.098543 -0.766399
C  -4.225566 1.273718 -0.256353
C  5.534434 1.580193 0.034311
C  5.764798 -0.604492 -1.045083
C  -2.724578 -2.140216 -0.800288
C  -2.522516 2.771433 0.657125
C  -3.859943 2.537872 0.2069
H  3.316577 0.353087 -1.493391
H  3.055368 1.057834 0.13417
H  2.95249 -1.131948 1.193156
H  3.327764 -1.977847 -0.340128
H  1.115497 -1.53003 -1.123412
H  -0.677927 -2.752811 -0.369766
H  -0.5617 1.921475 1.01569
H  -4.684426 -1.261869 -1.09578
H  -5.248504 1.081542 -0.601813
H  4.974066 2.132026 0.808919
H  5.502022 2.177898 -0.912225
H  6.58932 1.516124 0.357963
H  5.394949 -1.644727 -1.052256
H  6.820189 -0.629658 -0.719936
H  5.735521 -0.22046 -2.097819
H  -3.020155 -3.136473 -1.145883
H  -2.243826 3.763955 1.028079
H  -4.592527 3.352125 0.230558
