program: Orca
programVersion: 5.0.2
elementType: C H H H O H
charge: 0
multiplicity: 1
keywords: DLPNO-CCSD(T) def2-TZVPP def2-TZVPP/C VeryTightSCF NormalPNO
keywords: PAL8
formula: CH4O
InChI: InChI=1S/CH4O/c1-2/h2H,1H3
6 atoms
C  -0.021839 0.715531 -0.016208
H  0.464834 1.098904 0.880521
H  0.467255 1.159371 -0.8909
H  -1.072094 1.028576 0.000483
O  0.113843 -0.696284 0.010974
H  -0.309264 -1.058197 -0.768706
totalener: -115.09492410 hartree
nucrepener: 40.32715823 hartree
electener: -155.42208233 hartree
oneelecener: -236.92771233 hartree
twoeener: 81.50563000 hartree
kineticenergy: 114.95834583 hartree
energy: -559.2959 -306.6804 -36.8938 -25.1427 -18.7801 -16.8460 -16.1309 -13.6627 -12.2520 3.7045 4.7975 6.2538 6.2819 6.8954 8.9398 9.2029 12.4527 14.1033 15.1381 15.9793 16.4603 17.6188 17.9604 18.4662 19.5952 21.8762 22.5531 24.3531 25.2258 28.8032 29.0031 31.1041 31.1167 33.2719 34.5732 34.7636 37.1306 39.3081 40.0250 41.0956 42.0946 44.8336 45.6198 47.8208 52.8245 54.9970 58.1459 58.5067 59.3758 62.2042 65.3019 66.1778 76.3757 76.9198 77.5078 79.1112 83.4505 83.5925 84.5646 85.6460 86.2121 87.2785 88.1050 89.7297 90.9725 92.4197 95.1974 98.2289 98.5257 99.6900 101.5148 101.9980 102.9766 104.0974 106.7086 108.0272 108.5177 110.6191 111.4507 112.6271 115.7675 115.9087 117.9003 119.3462 120.8969 121.0718 122.3412 124.9082 126.4519 129.2380 132.1247 134.2024 136.0361 139.7247 143.2847 144.8650 146.4338 147.8879 150.8065 151.1641 153.1214 154.1142 158.8797 161.2777 165.9140 168.4148 174.9042 176.4387 190.6116 194.1250 196.1774 197.2116 200.3672 204.4790 214.7989 215.7627 669.2632 1234.7267 electronvolt
chargesum: -0.0000000
charge: 0.040655 0.066650 0.055214 0.055183 -0.434177 0.216474
charge: -0.046163 0.002035 -0.011227 -0.011219 0.210224 -0.143649
qa: 0.0407 0.0667 0.0552 0.0552 -0.4342 0.2165
va: 3.9328 0.9908 0.9880 0.9880 1.8992 1.0166
e0: -115.094924098 hartree
corrType: DLPNO BASED
energy: -115.555048212430
dipole: -0.54988 0.22496 -0.32492 2.11574 -1.74112 0.37463 -0.63578 0.13240 -0.50338
magnitude: 0.70661 au
magnitude: 1.79607 debye
