program: Orca
programVersion: 5.0.2
elementType: O H H H O H H O H H O H H
charge: 1
multiplicity: 1
keywords: DLPNO-CCSD(T) def2-TZVPP def2-TZVPP/C VeryTightSCF TightPNO
keywords: PAL8
formula: H9O4
InChI: InChI=1S/H3O.3H2O/h1H3;3*1H2
13 atoms
O  0.258395 0.254354 0.160837
H  1.080864 0.254705 0.666598
H  -0.235977 1.174461 0.228259
H  -0.405797 -0.477959 0.505226
O  -1.477775 -1.284061 1.038707
H  -1.681108 -2.165676 0.714642
H  -2.306232 -0.79181 1.159631
O  -1.109764 2.30504 0.437099
H  -1.145057 3.057529 -0.159642
H  -2.014767 2.05277 0.683036
O  -3.382165 0.823947 1.33549
H  -4.212135 0.826902 0.84641
H  -3.626073 1.001451 2.250821
totalener: -304.63123710 hartree
nucrepener: 153.29161062 hartree
electener: -457.92284772 hartree
oneelecener: -717.15248259 hartree
twoeener: 259.22963487 hartree
kineticenergy: 304.29109021 hartree
energy: -566.4182 -564.9394 -564.8328 -564.8313 -44.2156 -42.2884 -42.2051 -41.9158 -26.7621 -26.4334 -25.2030 -25.0394 -24.7999 -22.4795 -21.3962 -20.9913 -20.6292 -19.4052 -19.3183 -19.2545 -1.3405 -0.4434 0.0434 0.5425 1.3265 3.3337 3.4237 3.8253 3.8780 6.0650 6.7519 9.0350 9.2198 9.3444 9.9969 10.3150 10.5220 10.6041 11.3745 11.8934 12.8683 13.0603 13.1427 13.5379 13.8444 14.1444 14.4993 14.6994 15.4645 15.5512 16.1526 17.7473 18.5265 19.0189 19.4456 19.5558 20.6880 20.8247 21.3432 21.3591 22.5490 26.8786 27.4260 27.6247 28.1931 28.2820 28.7958 29.1574 29.5159 31.1440 31.4865 32.0593 33.7417 33.9430 34.3212 34.6980 35.1961 39.6910 39.9665 42.3195 43.2460 47.8016 48.5715 48.9192 49.2800 50.3028 50.6539 51.3981 51.7030 52.3414 52.8619 53.0884 54.9064 55.0061 56.2821 56.8299 56.9776 57.5139 58.6293 60.2824 61.1735 62.6685 64.1521 64.9025 67.6049 68.8311 69.3075 69.5577 70.4422 72.3695 77.6812 78.5530 78.8960 80.9070 83.2576 85.8171 85.8392 86.2734 87.1018 87.8407 88.4373 89.0246 89.5592 89.9620 90.5737 91.0791 91.6588 92.1716 92.2991 92.7025 92.9711 93.2858 93.7844 94.0006 94.7856 95.3160 95.6334 95.7662 96.3119 97.5124 98.6584 99.0454 99.5340 100.6675 101.2257 101.4492 101.5606 103.0259 103.4247 103.5531 103.9421 104.2128 104.3530 105.2231 105.9443 106.1284 107.7823 108.0017 108.0823 109.4949 110.4273 111.5522 112.1112 113.8727 114.4920 114.9570 115.0940 115.7486 116.3496 116.7573 116.9727 116.9963 118.4117 118.8451 119.5002 119.5160 121.7607 125.3183 127.0972 127.4671 129.2380 129.9277 130.4561 132.0587 132.9050 134.3538 135.4397 136.1010 136.6048 136.6400 137.5997 137.9842 140.7207 141.9401 142.4429 144.1702 152.3225 152.8151 159.7080 168.1181 169.2654 172.2128 173.4400 173.9634 175.8260 178.8963 182.3329 182.7623 183.2394 183.6462 184.0689 185.5497 185.7678 186.4626 186.6405 187.8748 188.8575 189.4767 189.7950 190.5889 190.8006 191.2810 191.7053 192.4560 194.3393 195.7118 195.9137 197.2356 198.8402 199.3710 201.9539 203.8573 204.9217 205.4698 206.8235 207.5321 208.5384 209.4453 211.8941 212.9315 213.3917 215.2725 216.5188 218.6806 221.1967 222.4182 1226.2517 1228.3212 1232.8412 1242.1087 electronvolt
chargesum: 1.0000000
charge: -0.305842 0.300570 0.348299 0.348327 -0.455985 0.285746 0.297790 -0.456166 0.285773 0.297772 -0.525881 0.287625 0.291971
charge: 0.664307 -0.031165 -0.131935 -0.131998 0.446617 -0.084844 -0.118598 0.446350 -0.084883 -0.118489 0.335787 -0.096960 -0.094187
qa: -0.3058 0.3006 0.3483 0.3483 -0.4560 0.2857 0.2978 -0.4562 0.2858 0.2978 -0.5259 0.2876 0.2920
va: 2.3061 0.9615 1.0027 1.0027 2.0846 0.9748 0.9886 2.0843 0.9748 0.9885 1.9738 0.9663 0.9612
e0: -304.631237101 hartree
corrType: DLPNO BASED
energy: -305.744213451495
dipole: -1.39207 0.86055 -0.53153 0.17156 -0.12496 0.04660 0.17048 -0.21697 -0.04649
magnitude: 0.53559 au
magnitude: 1.36135 debye
