program: Orca
programVersion: 5.0.2
elementType: O H H H O H H O H H O H H
charge: 1
multiplicity: 1
keywords: DLPNO-CCSD(T) def2-TZVPP def2-TZVPP/C VeryTightSCF TightPNO
keywords: PAL8
formula: H9O4
InChI: InChI=1S/H5O2.2H2O/c1-3-2;;/h1-2H2;2*1H2
13 atoms
O  0.17831 0.180363 0.234844
H  1.067491 0.152934 0.601714
H  -0.175043 1.117344 0.274703
H  -0.55992 -0.67668 0.618279
O  -1.324268 -1.526382 0.999394
H  -0.935883 -2.428399 1.191729
H  -2.119617 -1.624804 0.466571
O  -0.819457 2.56957 0.253058
H  -0.813587 3.130755 -0.527047
H  -0.966449 3.142817 1.009826
O  -0.23744 -3.809874 1.5860
H  -0.361826 -4.217244 2.447609
H  0.011163 -4.51248 0.979579
totalener: -304.63252972 hartree
nucrepener: 140.70773977 hartree
electener: -445.34026949 hartree
oneelecener: -692.54687715 hartree
twoeener: 247.20660766 hartree
kineticenergy: 304.29423711 hartree
energy: -565.3918 -565.3339 -564.3469 -564.3395 -43.4039 -42.4902 -41.5994 -41.5423 -26.3372 -25.8601 -25.5607 -24.3980 -24.3915 -22.1679 -20.9519 -20.4456 -19.9563 -19.6743 -18.8023 -18.7515 -1.0246 -0.3538 0.3284 0.4277 1.7748 1.7862 3.7093 3.8613 5.2626 7.2983 7.5364 8.3083 9.4403 9.6998 10.3883 10.6234 11.3942 11.5469 11.9195 12.2694 12.5857 13.2903 13.4056 13.6686 13.8263 14.3878 14.5849 15.0119 15.5041 15.5431 16.3596 16.6162 18.5586 18.7174 19.3971 20.0880 20.1409 20.9002 21.5064 21.7681 22.2791 23.7486 27.8586 28.2698 28.4018 29.2755 29.3466 29.9085 30.2591 30.5184 31.1000 32.0700 32.8947 33.0643 33.5978 34.5465 36.0219 36.4353 42.0010 42.3272 46.3238 47.5186 49.3058 49.7262 50.3631 50.7082 51.1569 51.2500 51.4252 52.0587 52.3359 52.8394 54.0981 54.3283 54.9958 56.8440 57.2670 58.5476 59.7790 60.4276 61.1478 62.2279 63.0407 65.2647 65.7168 68.8029 70.2875 71.1201 72.3444 72.6471 76.2465 76.3981 80.2640 80.5664 84.0525 85.5796 86.4145 86.9306 87.5161 88.5808 89.0372 89.3538 89.9859 90.1832 90.7674 91.6267 91.7876 92.2620 92.3430 92.6690 94.2063 94.2555 94.4667 94.5919 95.4553 95.5034 96.1095 96.1379 96.2511 96.4352 96.9119 99.2025 99.6793 100.3364 101.2191 101.2540 102.6017 102.8755 102.9653 103.5035 104.1425 104.5515 104.8442 105.3200 105.8458 106.9549 107.2340 108.6046 109.3116 109.5767 110.4667 110.6001 111.4866 112.5263 113.7406 114.1466 114.9173 115.6269 115.7470 116.9471 117.1910 117.2915 117.9317 119.0396 120.5533 122.8941 123.1083 124.5501 125.9053 129.6173 129.8154 130.7909 130.8475 131.8099 135.3811 135.9702 136.3006 136.4070 136.9764 137.4224 137.9119 140.2597 140.3964 142.2046 144.3529 147.4005 149.0849 152.8158 164.0646 165.0088 168.8752 174.3738 174.9097 177.3985 180.4451 182.3965 183.0824 183.6904 183.7572 184.6347 184.7840 185.7353 186.0513 186.5273 186.9123 187.3500 188.3987 190.0775 190.5995 190.9165 191.0072 191.3214 192.4005 194.0764 194.4010 196.3550 196.5400 196.8438 198.0693 199.9420 201.4979 202.2628 205.3031 205.3994 206.6910 208.0532 208.1248 211.3435 212.7855 212.9954 214.4703 215.6029 217.4583 217.9898 223.1626 224.8026 1227.1239 1229.0870 1235.5174 1246.3739 electronvolt
chargesum: 1.0000000
charge: -0.389741 0.284746 0.335269 0.359652 -0.393562 0.331841 0.285387 -0.478486 0.288540 0.284228 -0.479668 0.288144 0.283650
charge: 0.581267 -0.061431 -0.137587 -0.160881 0.574080 -0.138615 -0.062095 0.386657 -0.089524 -0.092162 0.382817 -0.089869 -0.092656
qa: -0.3897 0.2847 0.3353 0.3597 -0.3936 0.3318 0.2854 -0.4785 0.2885 0.2842 -0.4797 0.2881 0.2836
va: 2.1780 0.9749 0.9971 0.9963 2.1730 1.0005 0.9737 2.0369 0.9710 0.9737 2.0353 0.9713 0.9741
e0: -304.632529724 hartree
corrType: DLPNO BASED
energy: -305.744188356908
dipole: 0.08435 -0.01109 0.07326 -0.07924 0.02064 -0.05860 0.12153 -0.07333 0.04820
magnitude: 0.10547 au
magnitude: 0.26810 debye
