program: Orca
programVersion: 5.0.2
elementType: O H H H O H H O H H O H H
charge: 1
multiplicity: 1
keywords: DLPNO-CCSD(T) def2-TZVPP def2-TZVPP/C VeryTightSCF TightPNO
keywords: PAL8
formula: H9O4
InChI: InChI=1S/H3O.3H2O/h1H3;3*1H2
13 atoms
O  0.200052 0.33308 0.066168
H  1.19222 0.345561 0.253683
H  -0.243703 1.232977 0.180272
H  -0.288828 -0.419491 0.529034
O  -0.986839 -1.647206 1.1720
H  -1.341176 -2.367662 0.643474
H  -1.448876 -1.660147 2.014309
O  -1.009208 2.577483 0.291371
H  -0.842992 3.273356 0.932665
H  -1.432921 2.987223 -0.467934
O  2.729383 0.427355 0.4478
H  3.211139 0.220079 1.252837
H  3.340869 0.314111 -0.285188
totalener: -304.64283795 hartree
nucrepener: 143.26672784 hartree
electener: -447.90956579 hartree
oneelecener: -697.59332234 hartree
twoeener: 249.68375655 hartree
kineticenergy: 304.30825449 hartree
energy: -565.8544 -564.5933 -564.5933 -564.5921 -43.7431 -41.9107 -41.9098 -41.7476 -26.4136 -26.4131 -24.6666 -24.6496 -24.6486 -22.0909 -20.7419 -20.7406 -20.5239 -19.0793 -19.0442 -19.0428 -0.9510 -0.2506 -0.2504 1.5295 1.6623 1.6636 2.6852 4.6648 4.6696 6.8851 8.4956 8.5015 9.2878 9.2962 10.0114 11.3081 11.3104 11.3112 11.9777 12.4741 12.4745 13.2124 13.4836 13.4878 13.9373 14.4433 14.4438 15.3446 15.4395 15.4400 16.8916 18.2330 18.2449 18.7965 19.3559 19.3599 19.8078 20.9130 20.9209 21.2600 23.1591 23.1824 27.8512 28.6498 28.6535 29.1499 29.1566 29.9704 30.1813 30.9381 32.0838 32.0888 33.0096 33.0183 33.2637 36.0013 36.0110 36.0598 40.4872 43.8609 43.8750 48.6605 48.6701 49.9156 50.0332 50.0573 50.9890 50.9967 51.1278 51.4080 51.5486 51.5512 52.6143 54.2814 54.2951 56.7085 57.8969 57.9118 58.0657 60.9688 60.9771 61.5521 63.2309 63.2372 67.0550 70.0696 70.0806 70.6004 71.5465 71.5655 76.1586 76.3674 76.3813 81.3309 85.9400 85.9476 85.9519 87.5078 87.7209 87.7286 89.1348 89.1430 90.2591 91.3100 91.3244 91.3905 92.1183 92.1214 92.1272 92.9285 93.7223 93.7256 94.7739 95.0594 95.0628 95.2294 95.8822 95.9427 95.9434 97.5634 97.5676 98.7129 98.7782 98.7842 100.8002 102.3906 102.3928 102.8703 103.0684 103.0710 104.2507 104.2632 105.0061 105.4557 105.4601 105.9304 107.3144 109.0836 109.0865 110.1849 110.4635 110.4701 112.4863 114.0777 114.0907 114.8964 114.9085 115.3433 115.9324 116.5928 116.5964 117.3293 118.0717 118.0792 118.4400 120.9855 121.0114 123.3856 127.9298 130.3324 130.3489 130.5907 130.6142 130.6932 134.9375 134.9595 135.7974 137.2994 137.3130 137.9839 139.8844 139.9084 140.2190 140.4191 140.4539 146.0825 150.0403 150.0531 165.4528 165.4872 166.7159 174.3816 174.6080 174.6328 176.0975 182.0970 182.1102 183.5400 183.5427 183.6024 184.2912 184.8825 184.8943 186.1260 186.7881 186.8047 188.7387 188.7529 188.8080 190.7174 190.7214 191.3316 194.4760 194.6119 194.6170 196.5258 196.8575 196.8656 198.8790 198.8878 202.4780 203.0999 203.1109 205.3722 207.6626 207.6687 207.8900 212.7771 213.2059 213.2158 214.0145 214.0297 216.3080 218.8490 218.8583 224.1754 1226.1409 1230.9395 1230.9507 1245.8831 electronvolt
chargesum: 1.0000000
charge: -0.351025 0.342444 0.342524 0.342483 -0.467737 0.290512 0.284981 -0.467587 0.285019 0.290495 -0.467464 0.284949 0.290405
charge: 0.689931 -0.126439 -0.126551 -0.126387 0.404458 -0.085716 -0.089107 0.404742 -0.089062 -0.085679 0.404580 -0.089092 -0.085677
qa: -0.3510 0.3424 0.3425 0.3425 -0.4677 0.2905 0.2850 -0.4676 0.2850 0.2905 -0.4675 0.2849 0.2904
va: 2.2548 0.9951 0.9950 0.9950 2.0561 0.9702 0.9738 2.0563 0.9738 0.9702 2.0564 0.9738 0.9703
e0: -304.642837946 hartree
corrType: DLPNO BASED
energy: -305.750646667214
dipole: 0.03744 -0.01279 0.02465 0.10007 -0.03374 0.06633 0.49593 -0.16640 0.32952
magnitude: 0.33703 au
magnitude: 0.85667 debye
