program: Orca
programVersion: 5.0.2
elementType: O H H H O H H O H H O H H O H H
charge: 1
multiplicity: 1
keywords: wB97X-D3BJ Opt Freq def2-TZVPP def2/J RIJCOSX VeryTightSCF
keywords: PAL8 VeryTightOpt defgrid3
frequency: 0.00 0.00 0.00 0.00 0.00 0.00 31.46 50.89 71.40 100.76 105.01 177.89 198.06 212.78 215.89 248.23 273.55 325.96 351.44 427.27 434.68 499.30 514.88 571.57 629.31 631.64 638.14 651.72 887.19 989.92 1081.82 1475.68 1584.28 1644.51 1651.12 1667.74 1744.01 1764.62 3025.62 3070.00 3687.31 3712.74 3825.26 3873.19 3875.70 3907.71 3915.33 3918.20
frequency: 31.46 50.89 71.40 100.76 105.01 177.89 198.06 212.78 215.89 248.23 273.55 325.96 351.44 427.27 434.68 499.30 514.88 571.57 629.31 631.64 638.14 651.72 887.19 989.92 1081.82 1475.68 1584.28 1644.51 1651.12 1667.74 1744.01 1764.62 3025.62 3070.00 3687.31 3712.74 3825.26 3873.19 3875.70 3907.71 3915.33 3918.20
formula: H11O5
InChI: InChI=1S/H5O2.3H2O/c1-3-2;;;/h1-2H2;3*1H2
16 atoms
O  0.284045 0.466686 0.411936
H  1.055129 0.481704 0.987882
H  -0.240458 1.532075 0.25783
H  -0.358596 -0.24205 0.721359
O  -1.45088 -1.263175 1.215744
H  -1.465114 -2.176622 0.921326
H  -2.35906 -1.0077 1.438623
O  -0.798669 2.583695 0.118492
H  -0.828847 2.903498 -0.788832
H  -1.723297 2.590143 0.513042
O  -4.016079 -0.159852 1.924304
H  -4.790376 -0.445365 1.427753
H  -4.231253 -0.317986 2.849673
O  -3.158014 2.479184 1.153592
H  -3.557058 3.201429 1.643849
H  -3.532825 1.64947 1.486386
totalener: -382.80445457 hartree
nucrepener: 217.81343654 hartree
electener: -600.61789111 hartree
oneelecener: -949.99797925 hartree
twoeener: 349.38008814 hartree
kineticenergy: 381.33055768 hartree
exchangeener: -30.699577551806 hartree
correlationener: -2.123952559628 hartree
xcener: -32.823530111434 hartree
temp: 298.15 k
press: 1.00 atm
thermalcorrenthalpy: 0.00094421 hartree
totalenthalpy: -382.66755397 hartree
totalentropycorr: -0.04808325 hartree
gibbsenthalpy: -382.71563722 hartree
gibbsminuselec: 0.09826658 hartree
totalenthalpy: -382.66757187 hartree
totalenthalpy: -382.66665498 hartree
chargesum: 1.0000000
charge: -0.308771 0.267658 0.283519 0.274916 -0.432584 0.257319 0.256706 -0.309750 0.267629 0.274956 -0.444313 0.265772 0.265709 -0.432901 0.257430 0.256707
charge: 0.584937 -0.066112 -0.180085 -0.160073 0.400164 -0.103207 -0.151528 0.584272 -0.066401 -0.160340 0.374488 -0.100589 -0.100596 0.399991 -0.103243 -0.151680
qa: -0.3088 0.2677 0.2835 0.2749 -0.4326 0.2573 0.2567 -0.3098 0.2676 0.2750 -0.4443 0.2658 0.2657 -0.4329 0.2574 0.2567
va: 2.2465 0.9900 1.0571 1.0629 2.0896 1.0001 1.0401 2.2453 0.9900 1.0628 2.0853 0.9877 0.9878 2.0890 1.0000 1.0400
dispcorr: -0.009408845 hartree
energy: -382.814565022942
dipole: -1.58427 0.88412 -0.70015 -0.71267 0.39435 -0.31832 0.69634 -0.39169 0.30464
magnitude: 0.82725 au
magnitude: 2.10270 debye
zeropoint: 0.13364595 hartree
thermalvibcorrection: 0.00976421 hartree
thermalrotcorrection: 0.00141627 hartree
thermaltrasncorrection: 0.00141627 hartree
thermaltotal: -382.66832233 hartree
thermalcorr: 0.01259675 hartree
nonthermalcorr: 0.13364595 hartree
totalcorr: 0.14624270 hartree
totalenthalpy: -382.66737812 hartree
