program: Orca
programVersion: 5.0.2
elementType: C C H H H O C H H H H O C C H H H H C H H O H H
charge: 1
multiplicity: 1
keywords: wB97X-D3BJ OptTS Freq def2-TZVPP def2/J RIJCOSX VeryTightSCF
keywords: PAL8 defgrid3 VeryTightOpt
frequency: 0.00 0.00 0.00 0.00 0.00 0.00 -181.74 16.20 38.78 45.13 55.52 73.78 85.07 97.08 112.34 129.36 134.33 153.05 187.98 242.08 292.63 324.40 391.68 397.14 490.36 499.90 543.38 553.85 694.00 821.69 834.39 889.01 918.72 919.77 988.24 1074.89 1094.85 1123.98 1130.86 1250.00 1280.21 1391.13 1397.15 1406.86 1421.23 1455.74 1457.71 1464.52 1465.38 1472.52 1475.25 1479.21 1492.84 1547.19 1639.75 1674.84 1784.63 3064.58 3068.50 3069.85 3074.13 3127.75 3135.14 3136.53 3143.33 3179.90 3188.89 3202.00 3203.33 3263.29 3854.10 3948.00
frequency: 16.20 38.78 45.13 55.52 73.78 85.07 97.08 112.34 129.36 134.33 153.05 187.98 242.08 292.63 324.40 391.68 397.14 490.36 499.90 543.38 553.85 694.00 821.69 834.39 889.01 918.72 919.77 988.24 1074.89 1094.85 1123.98 1130.86 1250.00 1280.21 1391.13 1397.15 1406.86 1421.23 1455.74 1457.71 1464.52 1465.38 1472.52 1475.25 1479.21 1492.84 1547.19 1639.75 1674.84 1784.63 3064.58 3068.50 3069.85 3074.13 3127.75 3135.14 3136.53 3143.33 3179.90 3188.89 3202.00 3203.33 3263.29 3854.10 3948.00
formula: C6H15O3
InChI: InChI=1S/C3H7O.C3H6O.H2O/c2*1-3(2)4;/h4H,1-2H3;1-2H3;1H2
24 atoms
C  2.246242 0.004174 -0.164646
C  1.90878 -1.369861 -0.59197
H  0.948915 -1.339161 -1.116254
H  2.683666 -1.796053 -1.222994
H  1.752108 -1.982325 0.300537
O  1.475213 0.657345 0.588763
C  3.488069 0.672869 -0.593556
H  4.336808 0.056264 -0.281647
H  3.510446 0.688385 -1.687655
H  3.570323 1.678417 -0.1896
H  0.647534 0.160662 0.845001
O  -0.971911 -0.130905 -0.230031
C  -2.083755 0.371467 -0.298323
C  -3.013736 0.054192 -1.433599
H  -3.402648 0.975788 -1.871964
H  -3.874656 -0.496346 -1.044186
H  -2.511404 -0.543525 -2.190746
H  -2.645119 2.330106 0.303506
C  -2.576834 1.332941 0.747389
H  -3.584281 1.063656 1.07061
H  -1.901245 1.364038 1.600286
O  0.225346 -1.109387 2.210143
H  -0.637113 -1.516315 2.098081
H  0.409252 -1.126427 3.152857
totalener: -463.45583319 hartree
nucrepener: 477.65346245 hartree
electener: -941.10929564 hartree
oneelecener: -1565.34124749 hartree
twoeener: 624.23195186 hartree
kineticenergy: 461.43645089 hartree
exchangeener: -40.972865745333 hartree
correlationener: -3.041564790343 hartree
xcener: -44.014430535677 hartree
temp: 298.15 k
press: 1.00 atm
thermalcorrenthalpy: 0.00094421 hartree
totalenthalpy: -463.26206843 hartree
totalentropycorr: -0.05737325 hartree
gibbsenthalpy: -463.31944168 hartree
gibbsminuselec: 0.16518576 hartree
chargesum: 1.0000000
charge: 0.317376 -0.238639 0.158854 0.127821 0.150522 -0.131137 -0.210695 0.139748 0.140039 0.137727 0.297054 -0.420116 0.253846 -0.219932 0.111517 0.113981 0.111669 0.123049 -0.229905 0.115454 0.096287 -0.443355 0.251871 0.246964
charge: -0.062689 0.057568 0.049376 0.037027 0.048773 0.526693 0.067788 0.055721 0.055674 0.040322 -0.092745 0.104644 -0.240946 0.033775 0.034055 0.036136 0.024983 0.037855 0.028174 0.033646 0.019058 0.330469 -0.114684 -0.110675
qa: 0.3174 -0.2386 0.1589 0.1278 0.1505 -0.1311 -0.2107 0.1397 0.1400 0.1377 0.2971 -0.4201 0.2538 -0.2199 0.1115 0.1140 0.1117 0.1230 -0.2299 0.1155 0.0963 -0.4434 0.2519 0.2470
va: 3.7449 3.8605 1.0132 1.0075 1.0192 2.4547 3.8883 0.9949 0.9949 1.0101 1.0259 2.0357 3.9170 3.8754 1.0037 1.0036 1.0153 1.0040 3.8760 1.0046 1.0211 2.0585 1.0029 1.0058
dispcorr: -0.028794305 hartree
energy: -463.484627489952
dipole: -1.74833 2.68675 0.93842 -0.77362 0.42844 -0.34519 -1.52061 1.68704 0.16643
magnitude: 1.01365 au
magnitude: 2.57650 debye
zeropoint: 0.20633333 hartree
thermalvibcorrection: 0.01244906 hartree
thermalrotcorrection: 0.00141627 hartree
thermaltrasncorrection: 0.00141627 hartree
thermaltotal: -463.26301256 hartree
thermalcorr: 0.01528160 hartree
nonthermalcorr: 0.20633333 hartree
totalcorr: 0.22161493 hartree
totalenthalpy: -463.26206835 hartree
