program: Orca
programVersion: 5.0.2
elementType: C H H H C C H H H O H
charge: 1
multiplicity: 1
keywords: wB97X-D3BJ Opt Freq def2-TZVPP def2/J RIJCOSX VeryTightSCF
keywords: PAL8 VeryTightOpt defgrid3
frequency: 0.00 0.00 0.00 0.00 0.00 0.00 102.67 130.50 393.21 481.20 514.15 729.58 842.49 931.96 957.83 1085.55 1104.30 1173.54 1375.23 1390.45 1421.01 1440.63 1460.12 1476.92 1508.68 1628.11 3044.05 3052.60 3128.75 3135.55 3178.19 3201.33 3718.19
frequency: 102.67 130.50 393.21 481.20 514.15 729.58 842.49 931.96 957.83 1085.55 1104.30 1173.54 1375.23 1390.45 1421.01 1440.63 1460.12 1476.92 1508.68 1628.11 3044.05 3052.60 3128.75 3135.55 3178.19 3201.33 3718.19
formula: C3H7O
InChI: InChI=1S/C3H7O/c1-3(2)4/h4H,1-2H3
11 atoms
C  2.137629 -0.557378 0.054955
H  2.818235 0.054523 -0.538502
H  2.46347 -0.467138 1.100836
H  2.167922 -1.605597 -0.234377
C  0.774072 -0.014406 -0.00073
C  0.50131 1.432532 -0.044236
H  -0.536139 1.681375 0.179235
H  1.182212 1.960926 0.625688
H  0.742659 1.769227 -1.061111
O  -0.170164 -0.86896 -0.010602
H  -1.060557 -0.477112 -0.016225
totalener: -193.62573147 hartree
nucrepener: 128.89296238 hartree
electener: -322.51869385 hartree
oneelecener: -508.35261315 hartree
twoeener: 185.83391930 hartree
kineticenergy: 192.75600849 hartree
exchangeener: -17.453646675460 hartree
correlationener: -1.308011763921 hartree
xcener: -18.761658439381 hartree
temp: 298.15 k
press: 1.00 atm
thermalcorrenthalpy: 0.00094421 hartree
totalenthalpy: -193.53407974 hartree
totalentropycorr: -0.03403490 hartree
gibbsenthalpy: -193.56811464 hartree
gibbsminuselec: 0.06936000 hartree
energy: -531.6922 -289.8570 -285.7197 -285.3744 -40.9417 -31.7601 -29.4452 -27.0958 -23.5558 -22.5809 -22.5110 -20.1406 -19.8113 -19.5569 -19.5052 -19.1036 -5.5418 -2.5756 -1.2865 -0.2411 -0.0755 0.2515 0.4226 0.9531 1.0282 1.8600 2.5651 2.7986 3.2755 3.9400 4.7063 4.8356 5.0985 5.8919 6.3753 6.7026 7.8920 8.4752 8.7321 9.3150 9.6803 9.9952 10.4704 10.5417 10.9265 11.6537 12.0397 12.4765 12.9701 13.5139 14.5480 16.5409 17.2438 18.0415 19.1543 20.2838 20.7329 21.4286 21.8997 22.1836 23.1234 23.6386 23.7778 24.1586 24.7168 24.8441 26.3483 27.2881 27.9243 28.7691 29.1069 29.7760 31.7157 32.0170 32.6942 33.3070 34.2689 35.1469 35.2090 35.9492 36.2468 36.5030 37.4164 37.8727 38.4512 38.6912 39.3631 40.5845 40.9377 43.2534 44.7157 45.3239 47.2367 49.3362 50.2033 51.4914 52.9711 53.8356 55.8998 58.1685 59.8649 60.7473 63.1111 64.2313 65.3539 65.3828 65.9875 68.0425 68.7296 69.7039 70.2695 70.9966 71.5650 72.5734 72.8185 73.2298 73.7971 74.6109 75.1801 76.6900 77.7350 78.2345 78.7405 79.4538 79.6534 80.1148 80.8429 82.2712 82.3940 83.0714 84.1346 84.3485 85.4385 87.2014 87.3971 88.0238 89.0143 89.5494 90.2601 91.0391 91.6697 92.2410 92.4307 92.5522 93.1163 93.5897 95.1663 95.9630 96.9822 97.7034 97.7511 100.1228 100.9056 101.1642 101.6921 102.7978 103.3668 103.6542 104.4600 105.1046 105.7523 106.3107 106.6112 108.0342 108.8989 109.1236 110.0554 110.7803 111.3194 111.5647 113.2737 113.7799 115.0765 115.7470 116.2483 117.1907 117.9011 118.4181 119.8435 122.5026 123.1100 124.7958 125.2297 126.6466 127.4809 127.9321 130.4246 134.6681 135.4183 135.9710 137.8144 138.1438 138.9582 139.8123 140.7337 141.6066 142.0469 142.7573 143.1852 143.9000 144.8270 146.5813 147.9550 150.0274 150.6312 150.9515 151.8404 157.1479 161.5607 163.8315 171.1045 175.2824 179.4961 180.3825 183.8040 188.1664 197.9819 198.9082 620.2657 635.8256 643.1048 1192.0624 electronvolt
chargesum: 1.0000000
charge: -0.184507 0.144056 0.155750 0.154977 0.293322 -0.178725 0.116122 0.149742 0.161351 -0.090471 0.278383
charge: 0.083609 0.055985 0.071913 0.050820 -0.032681 0.075647 0.040380 0.061474 0.071658 0.545300 -0.024105
qa: -0.1845 0.1441 0.1558 0.1550 0.2933 -0.1787 0.1161 0.1497 0.1614 -0.0905 0.2784
va: 3.8662 0.9988 0.9936 1.0043 3.7704 3.8968 1.0119 0.9972 0.9903 2.4916 0.9747
dispcorr: -0.011743162 hartree
energy: -193.637474640217
dipole: 2.15794 -2.38882 -0.23088 2.79263 -2.18182 0.61081 0.05125 -0.04341 0.00783
magnitude: 0.65304 au
magnitude: 1.65989 debye
zeropoint: 0.09706541 hartree
thermalvibcorrection: 0.00255273 hartree
thermalrotcorrection: 0.00141627 hartree
thermaltrasncorrection: 0.00141627 hartree
thermaltotal: -193.53502396 hartree
thermalcorr: 0.00538527 hartree
nonthermalcorr: 0.09706541 hartree
totalcorr: 0.10245068 hartree
totalenthalpy: -193.53407975 hartree
