program: Gaussian 09
title: 000039695
version: EM64L-G09RevD.01
frameworkgroup: C1[X(C23H29NO3S)]
method: RPBEPBE
basis: SDD
operation: Freq
keyword: #p
keyword: freq=noraman
keyword: PBEPBE/SDD
title: #p freq=noraman PBEPBE/SDD
converged: YES YES NO NO
title: Mulliken charges:
elementType: S O O O N C C C C C C C C C C C C C C C C C C C C C C C H H H H H H H H H H H H H H H H H H H H H H H H H H H H H
charge: 0.173185 -0.283048 -0.333849 -0.260584 -0.297630 0.344840 -0.591437 0.276130 0.112070 -0.736054 -0.700528 0.130298 -0.424244 0.272495 0.545334 -0.749148 -0.701064 -0.701623 -0.217588 -0.365217 -0.624758 -0.485392 0.500554 -0.343609 -0.206604 -0.826478 0.300406 -0.673902 0.239909 0.235840 0.210449 0.233411 0.232161 0.202958 0.247025 0.237100 0.240899 0.216335 0.216030 0.216652 0.221727 0.204862 0.218828 0.221313 0.219924 0.204775 0.227077 0.251179 0.248645 0.235584 0.267432 0.238726 0.226907 0.239108 0.283490 0.292868 0.336231
chargesum: 0.00000
title: Mulliken charges with hydrogens summed into heavy atoms:
elementType: S O O O N C C C C C C C C C C C C C C C C C C C C C C C
charge: 0.173185 -0.283048 -0.333849 -0.260584 0.038601 0.344840 -0.115688 0.276130 0.112070 -0.060033 -0.013445 0.130298 -0.183345 0.272495 0.545334 -0.100131 -0.055647 -0.055611 0.009489 -0.114038 -0.376113 -0.249807 0.500554 -0.343609 0.060828 -0.121736 0.300406 -0.097544
polarizability: 3.38149745e+02 -3.61934373e+00 3.09932743e+02 -3.03868413e+01 5.07873774e+00 2.15078107e+02
1716.lowfreq: -7.5912 -3.2403 -0.0003 0.0012 0.0013 2.6698 11.1364 12.5476 26.4191
frequency: 10.8530 11.9250 26.2909 27.7026 43.6585 52.3506 61.5910 67.4387 86.8053 92.6397 106.3910 135.7526 150.9741 177.5182 183.2132 191.1944 202.6196 210.5234 218.1218 223.4167 238.8006 244.8243 255.5778 265.7011 268.2940 280.4248 301.8733 303.4108 306.7631 314.1732 325.1058 343.6589 377.3853 382.8935 407.8920 412.4890 428.1353 434.2492 447.8885 483.4458 491.3298 505.9722 523.8694 537.9816 540.0145 567.9511 577.4721 598.1934 600.9982 622.3803 640.2243 677.2708 691.4920 696.2983 720.6976 727.2112 730.8040 735.7725 775.5256 801.0584 821.2457 839.0582 843.7738 849.6168 893.4233 899.7355 904.7227 914.0506 919.6498 932.2815 939.3471 941.0129 956.0038 961.5417 966.4109 972.7648 992.1286 996.3236 1007.5205 1020.7242 1025.6993 1028.0552 1045.2443 1050.6774 1097.2095 1102.8797 1127.5924 1130.3088 1161.0380 1165.4077 1177.2613 1197.9276 1205.2683 1211.6480 1221.3567 1223.6244 1234.7113 1239.1671 1256.2466 1267.8660 1270.1839 1295.6834 1298.7485 1308.7246 1360.5844 1372.4562 1373.7208 1382.3712 1394.4788 1395.5722 1399.5180 1399.6202 1402.0456 1444.0719 1449.8622 1453.6512 1458.8950 1461.3731 1462.5542 1463.9042 1464.3574 1465.0974 1465.3076 1470.5162 1470.6343 1478.3472 1483.7835 1483.8384 1485.1036 1491.1506 1497.4965 1570.6906 1605.3391 1606.9128 1620.3982 1685.8017 2967.8286 2970.7176 2971.6340 2976.7257 2985.8479 2987.0393 2991.8422 3037.6221 3041.1710 3054.0514 3065.5865 3066.0815 3068.5068 3074.5243 3078.1603 3081.3588 3083.2476 3083.7533 3088.7532 3097.4364 3103.0004 3122.8046 3127.9798 3135.4491 3140.2360 3153.0847 3153.5551 3172.8134 3563.8439
redmass: 4.8203 4.7658 4.0319 4.1133 3.2293 4.0031 3.8897 4.6780 5.8436 7.0149 4.4406 1.1125 4.0945 3.7992 2.5920 1.1814 2.5581 1.2684 2.6034 3.3453 2.6518 1.4041 2.7351 1.2996 2.3814 3.9717 1.8039 1.8922 2.2659 2.9778 3.2247 2.6738 3.1890 3.1266 3.3038 3.4664 3.3531 2.7566 2.9459 3.2108 3.0281 4.6597 4.6653 3.8589 4.0071 4.2346 5.9625 4.5939 3.4593 1.4045 6.6944 4.9582 7.2855 6.9124 3.8410 6.1694 3.1524 4.1473 1.5359 3.2705 3.3475 1.5414 3.2251 3.5995 1.4616 1.4252 3.0547 1.6703 1.6735 1.6567 1.3723 1.2040 1.3561 1.8890 1.5225 1.9027 1.6181 3.1698 1.4718 1.4861 1.4058 4.0590 1.5315 2.0031 2.0701 3.1362 2.0086 1.8540 1.5503 1.5275 2.0843 2.0510 3.0076 2.7884 1.6259 1.6946 1.4847 2.0414 2.3267 2.1437 2.9043 2.2393 1.5005 1.2521 7.6423 1.2604 1.1892 1.2608 2.3533 1.6125 2.0565 1.5338 1.2506 1.1461 1.0802 2.5274 1.0508 2.1590 1.1348 1.2735 1.0585 1.1030 1.1742 1.1363 1.1029 1.0980 1.0741 1.1211 1.4233 1.5620 1.1328 6.6990 7.5214 6.0408 8.7818 9.7522 1.0375 1.0348 1.0347 1.0357 1.0526 1.0421 1.0404 1.0608 1.0971 1.0996 1.1000 1.0997 1.1003 1.0985 1.0995 1.0990 1.0990 1.0983 1.0989 1.1006 1.0999 1.1042 1.0882 1.0875 1.0898 1.0919 1.0953 1.0985 1.0773
irintensity: 0.3199 0.2342 0.0403 0.1545 0.5528 0.5947 2.5757 0.7749 4.2327 3.4815 5.1756 0.8030 4.3200 3.0086 5.1460 0.2316 0.9233 0.1671 1.4114 3.4540 0.7500 0.6960 0.4044 0.6070 1.0409 3.4117 2.3120 1.8710 1.2256 4.2296 3.3911 0.0328 4.5489 8.0903 7.4645 3.0464 1.4892 0.9626 4.7470 2.3520 0.1749 2.9114 1.5801 0.1548 2.8614 7.8990 4.3953 6.9313 5.9613 120.1848 20.9118 74.8936 17.8610 41.1503 2.9833 30.4146 4.0526 24.4139 51.9015 3.5010 6.3349 7.2580 86.0983 46.8431 3.9596 4.8666 4.7644 2.3068 4.5172 2.2514 1.3736 0.4580 1.4145 3.5246 5.4995 6.6356 12.3024 134.1050 12.7018 1.3570 0.7280 59.3256 7.5098 29.6450 19.1700 161.6242 41.4019 187.6073 154.1991 28.6315 182.7480 48.1946 6.6236 4.5520 25.4981 11.4850 92.8210 16.7916 6.5932 37.3459 59.2007 53.0138 6.4374 10.5913 3.5198 20.4851 18.5098 30.8648 16.0388 9.2465 36.0686 7.6524 11.7465 34.0297 5.3827 60.7893 0.0498 80.9729 16.9710 23.2121 14.7784 16.1083 55.1581 10.6209 19.3833 8.6191 51.3258 38.8138 154.2713 118.0657 50.4537 1.6664 6.1029 10.1987 12.1922 209.6738 28.8062 29.8525 33.5525 36.9349 23.3429 9.8229 38.7041 20.9731 16.4363 12.6725 3.4184 2.6881 24.0637 135.1549 28.2725 46.6806 9.7599 28.0104 40.6802 15.7199 28.4359 1.2712 16.5985 3.7363 13.1034 16.6104 8.2998 12.8235 45.3727
temp: 298.150 k
press: 1.00000 atm
elementType: 16 8 8 8 7 6 6 6 6 6 6 6 6 6 6 6 6 6 6 6 6 6 6 6 6 6 6 6 1 1 1 1 1 1 1 1 1 1 1 1 1 1 1 1 1 1 1 1 1 1 1 1 1 1 1 1 1
symmnumber: 1
zpe: 1227634.5 jmol-1
zpe.correction: 0.467581 hartree
zpe.thermalcorrener: 0.496909 hartree
zpe.thermalcorrenthalpy: 0.497854 hartree
zpe.thermalcorrgfe: 0.405016 hartree
zpe.sumelectzpe: -1570.267391 hartree
zpe.sumelectthermal: -1570.238063 hartree
zpe.sumelectthermalent: -1570.237119 hartree
zpe.sumelectthermalfe: -1570.329957 hartree
dipole: -2.4852 -0.5560 0.1321
dipole: 2.5501
quadrupole: -146.1336 -163.3363 -173.9617
quadrupole: 0.2700 -10.0209 -0.0503
quadrupole: 15.0102 -2.1924 -12.8178 0.2700 -10.0209 -0.0503
hfenergy: -1570.7349726 hartree
pointgroup: C01 [X(C23H29N1O3S1)]
dipole: 0.9720841 -0.2090627 -0.1338681 debye
polarizability: 335.3237966|9.3839511|308.6710626|-34.5996987|11.4622333|219.1657362 unknown
InChI: InChI=1S/C23H29NO3S/c1-15-12-17(22(2,3)4)10-11-19(15)28-14-24-21(25)26-18-9-7-8-16-13-23(5,6)27-20(16)18/h7-12,24H,13-14H2,1-6H3
charge 0 multiplicity 1
57 atoms
S  -1.970459 3.188981 1.075259
O  4.303129 0.731977 -0.138321
O  1.980429 0.386216 1.661177
O  1.16831 0.64469 -0.559283
N  0.678273 2.170595 1.16692
C  5.371341 0.409231 -1.199772
C  5.909529 -1.004398 -0.787588
C  4.813405 -1.552823 0.115336
C  3.944684 -0.485516 0.440853
C  6.409631 1.529912 -1.112924
C  4.630063 0.375237 -2.547214
C  -4.974033 -2.051349 -0.556802
C  4.600525 -2.831562 0.656999
C  2.838239 -0.687546 1.286665
C  -4.230771 -0.758286 -0.145688
C  -6.417598 -2.110334 0.005656
C  -5.055468 -2.127809 -2.111557
C  -4.190798 -3.288642 -0.022537
C  3.497307 -3.034033 1.527307
C  2.620722 -1.96761 1.836435
C  -4.817702 0.247664 0.660574
C  -2.897047 -0.538874 -0.579263
C  -4.133845 1.431463 1.03646
C  -2.798942 1.612001 0.577485
C  -2.185794 0.625854 -0.227195
C  -4.822129 2.47282 1.900089
C  1.259807 1.044788 0.622809
C  -0.194502 3.043388 0.408692
H  6.867306 -0.917452 -0.238681
H  6.086193 -1.633125 -1.67812
H  7.216977 1.359692 -1.848616
H  5.944254 2.507145 -1.328825
H  6.856026 1.572344 -0.104508
H  5.340381 0.182372 -3.372772
H  3.86149 -0.417204 -2.547995
H  4.125611 1.338799 -2.730527
H  5.273886 -3.661224 0.415546
H  -7.034057 -1.268851 -0.361491
H  -6.427886 -2.093947 1.111367
H  -6.903526 -3.048522 -0.319953
H  -5.620446 -1.268463 -2.517136
H  -5.566707 -3.058582 -2.422985
H  -4.052196 -2.120268 -2.57372
H  -4.124844 -3.264933 1.080728
H  -3.161097 -3.321253 -0.421097
H  -4.701187 -4.224085 -0.321065
H  3.313601 -4.023188 1.95859
H  1.759178 -2.114359 2.495321
H  -5.845096 0.12694 1.020166
H  -2.388421 -1.283216 -1.20262
H  -1.157904 0.733311 -0.586906
H  -4.257032 2.661955 2.833263
H  -5.839783 2.148435 2.175839
H  -4.904102 3.444772 1.375861
H  0.147359 4.09066 0.462667
H  -0.205553 2.715768 -0.641166
H  0.834666 2.347842 2.160464
