program: Gaussian 09
title: 000039618
version: EM64L-G09RevD.01
frameworkgroup: C1[X(C17H13NO5S)]
method: RPBEPBE
basis: SDD
operation: Freq
keyword: #p
keyword: freq=noraman
keyword: PBEPBE/SDD
title: #p freq=noraman PBEPBE/SDD
converged: YES YES NO NO
title: Mulliken charges:
elementType: S O O O O O N C C C C C C C C C C C C C C C C C H H H H H H H H H H H H H
charge: 0.339362 -0.265186 -0.262605 -0.207975 -0.419062 -0.216447 -0.292833 0.177460 0.233877 0.217293 0.216772 -0.555122 -0.397254 -0.654799 0.188739 0.171810 -0.773050 0.210636 -0.207553 -0.312301 0.195990 -0.226393 -0.136921 -0.508598 0.264738 0.285425 0.262439 0.254851 0.246964 0.272798 0.224822 0.240225 0.230556 0.297052 0.255299 0.271573 0.377416
chargesum: 0.00000
title: Mulliken charges with hydrogens summed into heavy atoms:
elementType: S O O O O O N C C C C C C C C C C C C C C C C C
charge: 0.339362 -0.265186 -0.262605 -0.207975 -0.041645 -0.216447 -0.292833 0.177460 0.233877 0.217293 0.216772 -0.290383 -0.111829 -0.137509 0.188739 0.171810 -0.028467 0.210636 0.263229 -0.312301 0.195990 0.070659 0.118378 -0.237025
polarizability: 2.96345968e+02 1.11158625e+01 2.55227163e+02 -7.24953163e+00 2.49006788e+01 1.53133387e+02
1716.lowfreq: -18.1565 -2.4587 0.0014 0.0018 0.0024 2.3223 4.4527 11.1554 29.2078
frequency: -18.0480 10.7759 29.1928 40.8639 53.1230 66.6360 85.6013 105.0784 114.0392 121.7127 147.2454 158.3123 187.7052 195.0838 223.9223 251.0287 268.4179 282.7616 329.7725 338.6361 358.1477 390.6694 411.7482 419.6110 426.5600 443.9847 494.2707 502.8279 560.0691 565.8364 574.9113 624.3446 641.9808 650.5059 665.1653 668.9540 677.7943 683.4053 695.6379 717.6680 722.5792 728.8388 754.8026 774.9543 782.1197 833.1891 842.3269 850.2063 852.3328 863.2987 868.6599 886.6895 913.8004 929.2642 969.4294 983.5933 1033.2631 1045.2632 1046.6773 1064.1477 1073.0609 1074.7107 1093.5375 1130.1091 1132.7945 1179.2997 1199.0045 1216.8143 1228.7616 1244.7121 1254.2510 1275.1419 1320.3540 1333.5576 1342.2662 1361.2371 1381.1988 1402.1514 1414.3952 1446.6686 1450.8095 1451.7633 1470.5052 1471.3967 1481.5922 1493.4701 1518.5023 1570.5714 1598.2546 1620.3220 1633.4863 1671.5371 2991.3935 2991.9843 3003.5813 3067.4627 3071.4096 3105.6130 3111.5010 3173.4769 3178.8291 3195.2524 3200.8635 3234.8635 3508.3063
redmass: 9.9299 7.2691 7.2272 7.6955 6.1933 6.7813 3.0683 3.0084 3.5887 1.4499 4.6173 5.7155 6.0662 4.1887 5.7461 6.2465 6.2139 3.3818 4.8174 8.9387 6.3668 5.4181 7.0588 3.3028 5.1967 5.4807 2.3596 6.3116 4.2453 3.6784 4.5076 4.7315 3.7870 4.3374 2.1527 6.8468 7.8775 7.3987 6.3740 2.5573 1.6975 4.9668 5.1884 6.2972 6.1499 5.2224 3.1808 1.7020 2.5293 1.6782 1.7234 2.6345 3.4623 1.3981 5.0935 2.9786 2.0161 1.9834 1.6548 3.7038 1.8138 1.5174 1.2459 2.1372 1.1262 2.2193 2.0778 1.6627 1.5026 2.1840 1.6022 4.2835 6.1803 1.9883 2.4823 1.2824 4.1861 2.4892 1.7425 1.1106 2.8287 1.3793 1.1976 2.2024 2.0297 2.9227 5.7147 9.2247 8.9425 8.4728 8.2733 8.5033 1.0420 1.0593 1.0625 1.0973 1.0948 1.0993 1.1083 1.0934 1.0899 1.0980 1.0932 1.1003 1.0639
irintensity: 1.5941 0.2371 1.1488 0.6793 2.7081 0.7885 7.9564 2.7243 4.3247 2.7841 2.5506 2.3002 1.1484 1.1361 3.3187 1.4785 1.4057 5.0193 1.1925 1.1013 2.6203 1.2986 2.9182 13.9632 8.0826 3.4300 29.7889 0.2489 4.6457 11.3894 19.1498 13.6043 45.4381 43.2631 66.7453 2.8238 0.0649 5.5764 4.2446 18.3397 94.1362 25.1878 2.4603 10.0050 60.6448 18.8006 33.6155 29.9075 12.9314 5.7574 33.6853 4.7540 61.9238 0.8228 85.8354 78.5295 175.2747 88.2572 83.1982 52.1288 8.7702 11.0484 12.4718 93.9754 13.6528 50.4756 27.1549 74.8379 19.5782 8.7632 40.3417 110.2638 455.5840 34.4765 56.0952 0.8065 157.3084 73.2135 64.0366 46.8369 80.1373 28.3849 12.1287 63.4290 10.3784 111.1341 54.5573 173.2430 1.7856 16.2348 8.4343 175.0388 79.4062 94.1784 17.6154 4.3826 11.3097 19.0248 30.4815 2.1966 3.7783 0.8755 0.9750 0.3360 23.8871
temp: 298.150 k
press: 1.00000 atm
elementType: 16 8 8 8 8 8 7 6 6 6 6 6 6 6 6 6 6 6 6 6 6 6 6 6 1 1 1 1 1 1 1 1 1 1 1 1 1
symmnumber: 1
zpe: 695629.7 jmol-1
zpe.correction: 0.264951 hartree
zpe.thermalcorrener: 0.285554 hartree
zpe.thermalcorrenthalpy: 0.286498 hartree
zpe.thermalcorrgfe: 0.212985 hartree
zpe.sumelectzpe: -1482.827045 hartree
zpe.sumelectthermal: -1482.806443 hartree
zpe.sumelectthermalent: -1482.805498 hartree
zpe.sumelectthermalfe: -1482.879012 hartree
dipole: 0.2676 1.9305 1.6477
dipole: 2.5521
quadrupole: -126.8439 -137.6788 -146.1997
quadrupole: -9.5957 -9.4738 0.1590
quadrupole: 10.0636 -0.7713 -9.2923 -9.5957 -9.4738 0.1590
hfenergy: -1483.0919965 hartree
pointgroup: C01 [X(C17H13N1O5S1)]
dipole: -0.0442771 0.7592336 0.655584 debye
polarizability: 292.6932071|15.7871643|259.0435471|-4.2098778|25.4701673|152.9697632 unknown
InChI: InChI=1S/C17H13NO5S/c1-9-10(6-16(19)20)11-5-13-14(23-8-22-13)7-12(11)18(9)17(21)15-3-2-4-24-15/h2-5,7,19H,6,8H2,1H3
charge 0 multiplicity 1
37 atoms
S  -4.53848 -1.43733 -0.561766
O  1.602908 4.070052 0.063682
O  -0.779519 3.945848 -0.147227
O  -1.913321 -2.530584 -1.743788
O  5.128931 -1.099122 1.127508
O  3.191656 -2.06323 1.97139
N  -0.435645 -1.083782 -0.62554
C  1.342842 0.347383 -0.341818
C  -0.087955 0.287429 -0.427197
C  1.849313 -1.005851 -0.499534
C  0.767604 -1.85848 -0.690531
C  2.0168 1.592929 -0.175141
C  -0.905553 1.447754 -0.41121
C  3.302552 -1.38774 -0.42337
C  1.201197 2.720038 -0.133506
C  -0.211515 2.647571 -0.256513
C  0.746432 -3.35107 -0.843551
C  -1.740236 -1.627713 -0.873928
C  0.381136 4.872182 -0.192443
C  -2.835374 -1.135257 -0.024645
C  3.807153 -1.562165 1.008887
C  -2.805081 -0.562992 1.249457
C  -4.106423 -0.33559 1.808272
C  -5.137829 -0.736292 0.96498
H  3.104177 1.66443 -0.094169
H  -1.991262 1.426654 -0.506471
H  3.94288 -0.641799 -0.924603
H  3.483256 -2.349804 -0.940124
H  0.120603 -3.829061 -0.066994
H  0.335048 -3.657327 -1.819938
H  1.767289 -3.751682 -0.735307
H  0.270894 5.623055 0.604266
H  0.446231 5.317818 -1.204026
H  -1.872274 -0.323855 1.765016
H  -4.274399 0.103767 2.793895
H  -6.212202 -0.674211 1.132056
H  5.448667 -1.254572 2.058129
