program: Gaussian 09
title: 000005571
version: EM64L-G09RevD.01
frameworkgroup: C1[X(C7H8NO2)]
method: RPBEPBE
basis: SDD
operation: Freq
keyword: #p
keyword: freq=noraman
keyword: PBEPBE/SDD
title: #p freq=noraman PBEPBE/SDD
converged: YES YES NO NO
title: Mulliken charges:
elementType: O O N C C C C C C C H H H H H H H H
charge: -0.430599 -0.180377 -0.057502 0.253618 -0.211692 -0.129448 -0.212685 -0.140494 -0.577011 0.174556 0.331546 0.296032 0.324229 0.291023 0.279129 0.265384 0.296470 0.427819
chargesum: 1.00000
title: Mulliken charges with hydrogens summed into heavy atoms:
elementType: O O N C C C C C C C
charge: -0.002780 -0.180377 -0.057502 0.253618 0.119854 0.166584 0.111545 0.150530 0.263972 0.174556
polarizability: 1.12852536e+02 -1.61417553e+00 9.46864155e+01 3.56790586e-01 -2.83392820e-01 3.77949209e+01
1716.lowfreq: -47.5071 -0.0006 0.0002 0.0004 2.9028 10.5057 12.3175 64.7307 154.3479
frequency: -47.3407 64.7198 154.3439 171.2120 204.2926 346.2327 375.1831 410.1117 463.8378 487.3765 534.6027 610.9283 629.1712 678.7278 717.1200 719.9726 835.8186 883.8744 948.4933 966.8377 1017.4754 1028.1773 1036.6760 1063.6173 1124.3186 1130.1234 1142.7132 1193.1720 1206.9556 1317.6594 1337.3831 1358.4214 1423.1950 1449.7164 1465.7339 1480.1267 1492.6502 1583.0784 1622.8785 1664.6463 3026.7356 3134.2646 3152.3854 3172.4979 3192.8791 3200.1065 3209.6705 3530.8970
redmass: 1.0264 8.0097 4.3240 5.0111 3.1286 4.8423 4.7413 2.8961 3.7113 4.9152 5.3786 4.8101 1.2852 2.4820 5.7746 3.2675 1.4762 4.9178 1.4973 1.3416 5.7177 1.3828 3.3481 1.6725 1.3701 1.4118 1.5310 2.3741 1.3016 1.4122 2.6446 4.5910 1.3633 1.5973 1.1918 1.1941 1.9456 5.7718 5.6606 10.0350 1.0338 1.1036 1.1046 1.0937 1.0929 1.0961 1.1016 1.0651
irintensity: 0.3114 0.9085 2.0118 0.2139 1.7816 7.0333 7.8495 7.9981 0.4138 10.4965 6.1717 39.6512 158.3371 0.1842 5.3756 88.1327 32.8167 1.9486 12.7927 0.0098 1.3101 0.2921 216.7916 2.1270 4.7818 0.0579 41.6971 38.2752 14.3279 9.3885 87.3805 2.5747 22.3746 3.1598 21.7618 22.9139 40.5317 6.6445 2.7510 224.2313 0.3412 1.0451 0.9285 6.1276 4.2295 15.6028 1.2849 121.2227
temp: 298.150 k
press: 1.00000 atm
elementType: 8 8 7 6 6 6 6 6 6 6 1 1 1 1 1 1 1 1
symmnumber: 1
zpe: 370609.1 jmol-1
zpe.correction: 0.141158 hartree
zpe.thermalcorrener: 0.149415 hartree
zpe.thermalcorrenthalpy: 0.150359 hartree
zpe.thermalcorrgfe: 0.107603 hartree
zpe.sumelectzpe: -475.775080 hartree
zpe.sumelectthermal: -475.766823 hartree
zpe.sumelectthermalent: -475.765879 hartree
zpe.sumelectthermalfe: -475.808635 hartree
dipole: 6.2639 -1.3102 0.0438
dipole: 6.3996
quadrupole: -29.4209 -38.0055 -57.0039
quadrupole: 5.4324 0.1542 -0.0570
quadrupole: 12.0559 3.4713 -15.5272 5.4324 0.1542 -0.0570
hfenergy: -475.9162374 hartree
pointgroup: C01 [X(C7H8N1O2)]
dipole: -2.4505555 0.5777972 0.0147173 debye
dipolederiv: -0.4977428 -0.2919349 0.0020521 -0.3292186 -1.1433345 0.0036466 0.001352 0.0027859 -0.4154692 -0.7863857 0.2279223 -0.0019892 -0.018503 -0.6699472 0.0021322 -0.0015175 0.0025932 -0.2820155 -0.275627 0.0907456 -0.0005736 0.0868158 -0.2232962 0.000363 -0.0412757 0.0369837 -0.0516702 -0.1526704 0.0432602 -0.0028081 -0.0707506 -0.3124068 -0.0035899 -0.0000025 0.0012587 0.0431362 0.1239115 -0.1831827 0.0015238 0.0681715 0.1181374 0.00554 0.0104758 -0.005697 0.0316431 0.1700392 0.0940944 -0.0046162 -0.2180634 0.1514806 -0.0019918 0.0069842 -0.0096589 0.0076456 0.16382 -0.0934274 0.0012358 0.0228776 0.1785335 -0.0014836 0.0013338 -0.0016063 0.0176536 -0.3300041 0.080694 0.0040672 0.2003793 0.1545511 0.003768 -0.0003672 -0.0016156 -0.0707573 0.2621687 -0.1525304 -0.0040014 -0.1565682 0.22981 0.0057728 0.0468108 -0.0429478 0.1355678 1.4349042 0.0661304 0.0015204 0.2952829 1.4586533 -0.0058506 0.0026283 -0.0050379 0.2646757 0.1710856 0.0299051 -0.0010099 0.0144526 0.1179345 0.0012023 -0.0015739 0.0035395 0.1728025 0.0717977 0.0084389 -0.0017412 0.0361817 0.127795 0.0015529 -0.0040209 0.0008752 0.1742705 0.1366938 0.0374063 -0.0002326 0.0096384 0.1429579 0.0001483 -0.0004134 0.0004305 0.1572969 0.0955638 -0.0209077 -0.0010142 -0.0231369 0.0804237 0.000386 -0.0015887 0.0006968 0.1706784 0.0567512 -0.048162 0.0788923 0.0033563 0.0634222 0.0460286 0.0349439 0.0562737 0.0880551 0.0327908 -0.0104821 -0.0368683 -0.082924 0.0425458 -0.053496 -0.0406169 -0.0203611 0.1259977 0.0922408 0.0372857 -0.033254 0.0456461 0.0942788 -0.0045163 -0.0120341 -0.0190048 -0.0027221 0.2306626 0.0847442 -0.001183 0.1163622 0.3884609 0.0003876 -0.001118 0.0004921 0.4332112 unknown
polarizability: 112.7595661|-2.0729428|94.7804133|-0.2879929|0.2342031|37.7938933 unknown
InChI: InChI=1S/C7H8NO2/c1-8-4-2-3-6(5-8)7(9)10/h2-5,9H,1H3
charge 1 multiplicity 1
18 atoms
O  2.2625 1.57783 -0.004641
O  2.981027 -0.649156 0.009571
N  -1.707468 0.529693 -0.01358
C  0.60975 -0.138686 -0.00026
C  -0.374283 0.863941 -0.009412
C  -2.105564 -0.789271 -0.007948
C  0.220244 -1.500869 0.004201
C  -1.154876 -1.820831 0.000953
C  -2.733484 1.623016 0.009166
C  2.074685 0.204179 0.002101
H  -0.11131 1.923832 -0.012697
H  -3.180753 -0.979587 -0.010299
H  0.994159 -2.275332 0.008815
H  -1.497976 -2.857638 0.002738
H  -2.4023 2.449137 -0.637362
H  -3.69128 1.236237 -0.366986
H  -2.860749 1.985118 1.042302
H  3.228779 1.817287 -0.002961
