program: Gaussian 09
title: 000005570
version: EM64L-G09RevD.01
frameworkgroup: C1[X(C7H7NO2)]
method: RPBEPBE
basis: SDD
operation: Freq
keyword: #pfreq=noraman
keyword: PBEPBE/SDD
title: #p freq=noraman PBEPBE/SDD
converged: NO YES NO NO
title: Mulliken charges:
elementType: O O N C C C C C C C H H H H H H H
charge: -0.366368 -0.350159 -0.053432 -0.289103 0.194701 -0.163840 -0.265855 -0.592580 -0.171610 0.119185 0.329977 0.258841 0.317144 0.267228 0.242025 0.272828 0.251017
chargesum: 0.00000
title: Mulliken charges with hydrogens summed into heavy atoms:
elementType: O O N C C C C C C C
charge: -0.366368 -0.350159 -0.053432 0.040875 0.194701 0.095001 0.051289 0.189500 0.079407 0.119185
polarizability: 1.40097659e+02 5.91621692e+00 1.02999061e+02 4.31182665e-01 -2.04722256e-01 3.97594984e+01
1716.lowfreq: -62.3995 -48.7169 -7.1942 -0.0009 -0.0002 0.0006 5.7261 8.5866 85.7085
frequency: -61.9844 -48.6235 85.7024 161.9909 202.1604 332.5101 372.8133 405.6817 448.0337 487.1798 537.6327 654.1238 658.9381 721.8749 728.1782 805.6581 876.7986 920.0371 944.4240 1006.1727 1008.8687 1042.8896 1084.1437 1099.9804 1119.1052 1175.2788 1181.8693 1205.5029 1263.6025 1368.4274 1415.4419 1445.5009 1456.8109 1473.3024 1479.8713 1539.4648 1551.6665 1601.6842 3018.5308 3120.8950 3140.4332 3154.2065 3154.9748 3172.5579 3197.0675
redmass: 1.0251 7.9120 5.5751 5.8300 3.2480 5.5318 4.3171 3.3210 4.0980 5.4382 5.7151 8.4861 3.4994 2.8195 7.9657 1.5259 4.7343 1.5122 1.2813 1.3703 5.7828 1.6158 1.6925 1.2992 1.3623 2.4001 1.7714 6.1488 1.5728 4.1869 1.4266 2.5483 1.5725 1.1213 1.1382 8.1978 7.3079 5.8702 1.0340 1.1023 1.1033 1.0911 1.0943 1.0924 1.0993
irintensity: 0.2716 0.8188 2.4767 4.7240 3.0066 12.2255 6.6442 0.0617 5.7007 5.1130 0.7194 10.1593 6.8136 51.2202 11.6574 31.1822 0.4226 11.8787 4.7357 0.4411 17.3353 2.7054 26.3039 17.1414 8.1893 32.5757 54.2922 18.7231 0.0496 0.6564 4.5150 14.3707 3.4800 23.2553 27.7233 94.4084 122.3477 32.2254 18.2983 7.3525 5.4698 2.9757 3.9965 3.5212 2.8816
temp: 298.150 k
press: 1.00000 atm
elementType: 8 8 7 6 6 6 6 6 6 6 1 1 1 1 1 1 1
symmnumber: 1
zpe: 333889.6 jmol-1
zpe.correction: 0.127172 hartree
zpe.thermalcorrener: 0.134659 hartree
zpe.thermalcorrenthalpy: 0.135603 hartree
zpe.thermalcorrgfe: 0.094462 hartree
zpe.sumelectzpe: -475.381830 hartree
zpe.sumelectthermal: -475.374343 hartree
zpe.sumelectthermalent: -475.373399 hartree
zpe.sumelectthermalfe: -475.414540 hartree
dipole: 14.1347 1.9207 0.0211
dipole: 14.2646
quadrupole: -69.8486 -53.3054 -58.7703
quadrupole: -7.6112 0.2189 0.0277
quadrupole: -9.2072 7.3360 1.8712 -7.6112 0.2189 0.0277
hfenergy: -475.5090014 hartree
pointgroup: C01 [X(C7H7N1O2)]
dipole: -5.5911349 -0.484972 -0.0047413 debye
dipolederiv: -0.6574163 -0.1158822 -0.0004482 0.160709 -0.880834 -0.0000758 0.0095714 0.0058122 -0.4288295 -0.8668883 0.2452811 -0.00232 0.2692107 -0.7389034 0.0005081 -0.004132 -0.0011743 -0.4137728 -0.4818053 0.1736732 -0.000198 0.3320049 -0.1588727 -0.0048017 -0.0661836 0.0399741 -0.05216 0.3528027 -0.1909118 0.0028909 0.2358995 0.1466503 0.0032261 -0.0130322 -0.0123144 -0.0383506 -0.0066214 0.1137787 -0.0030464 0.0382547 -0.2322533 -0.0036233 -0.0107616 -0.004895 0.102273 0.0762738 0.0464511 -0.0064576 -0.4319382 0.0532195 -0.0018491 0.0188664 -0.0060954 -0.0809573 0.3511042 -0.042746 -0.002637 -0.1420764 0.0853208 -0.0032675 -0.0056405 -0.0002288 -0.0409385 0.3128779 -0.1248052 -0.006515 -0.2217803 0.2503297 0.0224899 0.0561998 -0.0214482 0.1707819 -0.3907061 0.0278996 0.007249 0.2022412 0.1632025 0.0019142 0.016454 0.0022646 -0.1167242 0.9111142 -0.1079594 0.0068691 -0.4750057 0.9220667 0.0015753 0.0237868 0.0018116 0.1197343 0.1776959 -0.007943 -0.000363 0.0549298 0.0803912 0.0023821 -0.0112835 0.0033949 0.1673053 -0.0230349 -0.0088469 -0.0010456 0.0134247 0.1074948 0.0018861 -0.0032136 0.0014418 0.1785663 0.1173406 0.071525 0.0006507 0.0130071 0.1034613 0.0002158 -0.0084595 -0.0011929 0.1532504 0.0664588 -0.066628 0.0692408 0.0201368 0.0187771 0.0569604 0.0175276 0.0683937 0.075997 -0.0457344 0.0034747 -0.0564181 -0.0832943 0.0431864 -0.0597605 -0.0652516 -0.0242996 0.0965762 0.045878 0.0479861 -0.0066324 0.0800188 0.0619772 -0.0185804 0.0482777 -0.0528846 -0.0515918 0.0606607 -0.0643471 -0.0008192 -0.0657424 -0.0252141 0.0008002 -0.0027257 0.0014403 0.1588402 unknown
polarizability: 140.5851454|4.0900545|102.5128329|-0.186699|0.2537455|39.7582401 unknown
InChI: InChI=1S/C7H7NO2/c1-8-4-2-3-6(5-8)7(9)10/h2-5H,1H3
charge 0 multiplicity 1
17 atoms
O  2.247416 1.595567 0.0078
O  2.938591 -0.667125 0.014856
N  -1.720507 0.518604 -0.020448
C  -0.383529 0.854274 -0.018806
C  0.611103 -0.136461 -0.005681
C  -2.111994 -0.806569 -0.008805
C  0.224438 -1.497125 0.000969
C  -2.745434 1.600733 0.011526
C  -1.152925 -1.827248 0.000637
C  2.095153 0.306336 0.005791
H  -0.075885 1.90589 -0.025578
H  -3.186604 -0.999875 -0.008247
H  1.028651 -2.241466 0.006284
H  -2.387726 2.456629 -0.579682
H  -3.688832 1.234603 -0.420449
H  -2.916771 1.923061 1.051965
H  -1.493747 -2.866128 0.004968
