program: Gaussian 09
title: 000039712
version: EM64L-G09RevD.01
frameworkgroup: C1[X(C21H27NO3S)]
method: RPBEPBE
basis: SDD
operation: Freq
keyword: #p
keyword: freq=noraman
keyword: PBEPBE/SDD
title: #p freq=noraman PBEPBE/SDD
converged: YES YES NO NO
title: Mulliken charges:
elementType: S O O O N C C C C C C C C C C C C C C C C C C C C C H H H H H H H H H H H H H H H H H H H H H H H H H H H
charge: 0.174150 -0.290163 -0.331129 -0.256699 -0.300933 0.139877 0.499339 -0.699355 -0.747720 -0.698153 -0.411544 -0.421463 -0.272953 -0.247398 -0.230917 0.025912 -0.647013 0.309013 -0.696102 -0.699068 0.231087 -0.348163 -0.341744 0.306833 -0.237156 -0.233686 0.222160 0.216407 0.206730 0.215273 0.216978 0.215895 0.219478 0.221869 0.206556 0.247719 0.232559 0.246793 0.308959 0.190990 0.302910 0.282559 0.209149 0.240648 0.257585 0.200552 0.226609 0.252330 0.340488 0.239112 0.250281 0.224907 0.229652
chargesum: 0.00000
title: Mulliken charges with hydrogens summed into heavy atoms:
elementType: S O O O N C C C C C C C C C C C C C C C C C C C C C
charge: 0.174150 -0.290163 -0.331129 -0.256699 0.039555 0.139877 0.499339 -0.054059 -0.099574 -0.050251 -0.163825 -0.188904 -0.026160 0.061561 -0.230917 0.216902 -0.061545 0.309013 0.011280 -0.019577 0.231087 -0.109051 -0.091463 0.306833 -0.012249 -0.004034
polarizability: 3.34802268e+02 2.85607317e+00 2.54012280e+02 -3.63684123e+01 1.08383598e+01 2.16452993e+02
1716.lowfreq: -9.4925 -1.9900 -0.0020 -0.0015 -0.0013 7.8281 11.2027 18.8006 21.8147
frequency: 10.7028 18.6323 21.7807 40.3255 47.8145 54.5383 63.3234 71.2480 77.0389 93.2840 100.3747 127.9661 147.4655 173.4659 183.4295 187.2113 200.9591 221.8008 239.9257 245.0505 249.7904 262.0702 268.9722 283.3414 300.2050 309.8216 315.5162 333.5133 340.1465 350.4575 374.2152 406.0000 410.9988 415.0497 439.7308 444.7635 454.8298 456.4876 499.7127 540.9300 551.0404 568.2743 578.7677 583.3387 607.4830 624.0453 632.8646 646.6106 700.9278 721.6601 729.0794 732.5123 737.7360 752.4903 789.2132 834.6744 836.9113 841.2091 847.8687 864.6369 867.2342 918.4513 921.3774 927.9522 930.2537 930.5415 941.8342 945.3057 960.7113 966.9239 973.9258 996.3540 1001.9728 1020.6769 1025.6069 1035.6633 1071.3906 1086.3555 1103.0145 1110.0863 1112.6923 1128.5898 1152.4705 1155.1931 1171.4049 1185.1173 1201.7617 1205.5344 1207.3531 1216.1381 1234.8956 1242.6548 1270.1527 1272.5218 1283.5312 1311.6676 1318.5327 1341.5137 1352.4188 1373.2601 1376.5122 1382.3491 1384.8365 1398.1583 1401.0675 1404.7462 1432.9135 1438.9085 1455.5105 1459.5677 1465.3650 1466.8416 1469.0718 1469.4740 1477.1210 1479.1675 1486.3975 1488.1713 1489.7534 1491.7366 1498.5329 1565.3956 1586.5199 1600.1389 1612.7523 1686.5149 2971.3052 2971.3836 2972.9076 2977.8305 2988.5121 2991.9402 3058.7212 3066.5532 3067.9776 3070.2001 3075.8400 3077.6954 3081.2729 3084.6327 3092.8296 3096.1006 3101.5011 3116.0430 3134.4780 3134.7093 3136.3400 3144.7837 3151.5281 3161.3911 3163.0759 3175.5830 3567.7730
redmass: 5.1999 3.5660 3.8168 4.8528 4.2815 4.6255 3.8889 4.4030 3.9228 4.6562 6.2561 4.7467 3.2177 4.0728 2.3322 1.3749 1.8230 1.7181 1.2926 2.9396 2.5829 1.2925 2.6471 4.2112 4.7510 1.1934 2.3051 3.1801 3.2059 2.8207 3.2610 3.5526 3.1361 3.3952 3.2563 3.6078 3.4120 2.9849 4.4455 4.1584 2.8130 3.5359 4.4268 2.0776 6.5647 2.4460 5.8918 5.1567 6.8299 5.7158 3.7384 3.5317 3.9865 1.3413 3.9551 2.5764 2.0194 1.6086 1.7738 2.6247 1.5427 1.7331 2.4384 1.5225 1.3800 1.6476 1.2011 1.3203 1.3342 1.3044 2.4170 1.6256 2.5829 1.4137 1.3841 2.0268 3.9114 3.1018 1.8283 4.1200 1.8814 1.6378 2.0072 1.9416 1.1755 1.9835 2.1053 2.9696 1.1325 2.6348 1.2496 2.8916 1.4938 3.0306 1.1795 1.2798 1.3195 1.3964 5.2039 1.1895 1.2745 2.6118 1.7802 2.7893 1.2395 1.2149 1.1093 2.3774 1.0497 1.0509 1.0557 1.1145 1.0698 1.0466 1.4525 1.5636 1.4402 1.2053 1.4900 1.2113 1.1150 6.8051 6.8978 5.9265 7.1897 9.3652 1.0818 1.0367 1.0348 1.0358 1.0355 1.0368 1.0570 1.1001 1.0998 1.1005 1.0985 1.0995 1.0990 1.0990 1.1002 1.1005 1.1002 1.0889 1.0859 1.0956 1.0881 1.1109 1.0898 1.0950 1.0944 1.1002 1.0775
irintensity: 0.3111 0.2985 0.2542 1.2017 2.7449 1.1164 2.6639 1.0820 0.4540 0.5658 4.2983 4.3752 0.4927 0.2846 0.2656 0.3279 0.7804 0.8153 1.0961 0.4614 0.2316 0.2285 1.0743 1.6250 2.3705 0.1626 0.3393 4.2894 1.9724 0.0328 10.6394 12.3158 6.5778 9.0997 7.6836 16.7145 3.2037 0.1079 5.5397 0.3270 14.1811 5.8112 9.3515 39.4891 3.4074 94.3033 10.2970 1.6202 58.5825 4.8701 14.5134 0.7409 4.9929 82.4060 14.7172 4.2729 70.8443 26.3413 32.9463 3.8906 28.3264 2.7451 27.6331 15.1287 8.8319 3.4265 0.3130 0.4593 0.3127 0.1288 57.9973 7.7407 20.5332 3.6121 0.2802 26.0777 6.8405 16.8046 52.9432 159.3286 35.0475 28.2167 87.3401 182.7026 62.5809 104.1304 123.9237 6.7621 1.5875 1.4217 162.2871 169.1343 22.2260 35.8036 9.0903 0.6088 7.3840 1.1996 4.4276 17.8638 18.7824 19.7566 19.2272 16.6295 16.1699 13.4936 14.4920 14.3265 3.3956 0.1611 2.7462 11.0846 5.2637 9.8403 177.5645 320.5486 23.7511 12.9018 30.0734 45.1893 42.5059 0.2080 4.0963 0.3676 36.7314 184.0393 52.2639 23.9885 30.7122 34.8227 15.4120 17.6052 20.3731 5.5281 4.5242 14.4589 131.2336 38.8737 46.8147 14.4227 26.5948 21.7744 24.5960 19.8238 4.1083 20.7311 2.3093 2.6060 15.8357 18.3759 19.8764 12.9222 52.9590
temp: 298.150 k
press: 1.00000 atm
elementType: 16 8 8 8 7 6 6 6 6 6 6 6 6 6 6 6 6 6 6 6 6 6 6 6 6 6 1 1 1 1 1 1 1 1 1 1 1 1 1 1 1 1 1 1 1 1 1 1 1 1 1 1 1
symmnumber: 1
zpe: 1139668.5 jmol-1
zpe.correction: 0.434077 hartree
zpe.thermalcorrener: 0.461662 hartree
zpe.thermalcorrenthalpy: 0.462606 hartree
zpe.thermalcorrgfe: 0.373538 hartree
zpe.sumelectzpe: -1492.979320 hartree
zpe.sumelectthermal: -1492.951736 hartree
zpe.sumelectthermalent: -1492.950791 hartree
zpe.sumelectthermalfe: -1493.039859 hartree
dipole: -0.3125 -0.5279 0.7383
dipole: 0.9599
quadrupole: -150.6856 -147.8316 -159.7505
quadrupole: -0.9816 0.0182 -6.4786
quadrupole: 2.0703 4.9243 -6.9946 -0.9816 0.0182 -6.4786
hfenergy: -1493.4133973 hartree
pointgroup: C01 [X(C21H27N1O3S1)]
dipole: 0.0797773 -0.3229696 -0.1787372 debye
polarizability: 328.6527418|-30.0296608|246.3876861|-33.6973227|-16.8025619|230.2271133 unknown
InChI: InChI=1S/C21H27NO3S/c1-15(2)24-18-8-6-7-9-19(18)25-20(23)22-14-26-17-12-10-16(11-13-17)21(3,4)5/h6-13,15,22H,14H2,1-5H3
charge 0 multiplicity 1
53 atoms
S  1.022541 1.830619 -2.040211
O  -2.888047 -0.389253 -1.175783
O  -3.181033 1.972319 0.123255
O  -1.181848 1.032608 0.997511
N  -1.180584 2.821999 -0.526993
C  5.074803 -1.855829 0.980657
C  4.085848 -0.93335 0.229233
C  4.456995 -3.280354 1.116965
C  6.434157 -1.985577 0.247275
C  5.338836 -1.273198 2.40248
C  4.424248 -0.251686 -0.967508
C  2.774388 -0.730998 0.743809
C  3.50307 0.602806 -1.616806
C  1.833144 0.09512 0.09566
C  2.203179 0.774311 -1.090764
C  -2.461543 -1.68456 -1.789048
C  0.251081 2.940866 -0.649917
C  -3.833233 -0.380443 -0.152155
C  -1.572729 -2.465262 -0.806684
C  -1.732123 -1.278025 -3.072571
C  -3.9757 0.861278 0.530433
C  -4.669547 -1.458748 0.226544
C  -4.937177 1.040863 1.534251
C  -1.769418 1.847961 0.254386
C  -5.638164 -1.279925 1.2415
C  -5.782718 -0.035753 1.893266
H  4.261479 -3.720877 0.122137
H  3.502013 -3.26137 1.671823
H  5.152072 -3.946631 1.662081
H  6.945713 -1.009578 0.155571
H  6.313247 -2.412711 -0.765518
H  7.100314 -2.658736 0.817514
H  4.405097 -1.185773 2.986313
H  5.791193 -0.266655 2.336767
H  6.031152 -1.929823 2.962798
H  5.420236 -0.367024 -1.405618
H  2.465479 -1.236305 1.666536
H  3.797711 1.138121 -2.525991
H  0.823826 0.210962 0.508883
H  -3.374135 -2.264384 -2.041238
H  0.745284 2.637332 0.284164
H  0.519936 3.973109 -0.915876
H  -1.265264 -3.42605 -1.259054
H  -2.097485 -2.68058 0.140126
H  -0.666237 -1.880635 -0.574017
H  -1.358279 -2.176103 -3.596644
H  -2.409305 -0.729956 -3.750003
H  -0.875823 -0.623395 -2.832576
H  -1.795004 3.336854 -1.159174
H  -4.581211 -2.429989 -0.269122
H  -5.01054 2.01633 2.024868
H  -6.281442 -2.121976 1.519508
H  -6.535056 0.097756 2.676755
