program: Gaussian 09
title: 000039553
version: EM64L-G09RevD.01
frameworkgroup: C1[X(C18H30N2)]
method: RPBEPBE
basis: SDD
operation: Freq
keyword: #pfreq=noraman
keyword: PBEPBE/SDD
title: #p freq=noraman PBEPBE/SDD
converged: NO YES NO NO
title: Mulliken charges:
elementType: N N C C C C C C C C C C C C C C C C C C H H H H H H H H H H H H H H H H H H H H H H H H H H H H H H
charge: -0.058209 -0.075852 0.343526 0.361278 -0.200583 -0.514568 -0.460482 -0.494639 -0.448135 -0.818276 -0.796740 -0.805068 -0.409614 -0.037180 -0.024657 -0.434483 -0.380239 -0.345208 -0.436587 -0.446941 0.220723 0.216683 0.218761 0.220419 0.216284 0.215332 0.188569 0.192880 0.232802 0.214468 0.230000 0.209752 0.210404 0.212888 0.238541 0.211703 0.211901 0.232334 0.231519 0.214262 0.213457 0.239526 0.227884 0.177124 0.175067 0.238087 0.228036 0.210814 0.203830 0.228610
chargesum: 0.00000
title: Mulliken charges with hydrogens summed into heavy atoms:
elementType: N N C C C C C C C C C C C C C C C C C C
charge: -0.058209 -0.075852 0.343526 0.361278 0.020140 -0.079124 -0.023780 -0.090738 -0.022453 -0.164056 -0.134908 -0.149131 0.036167 -0.037180 -0.024657 0.018501 0.024769 0.067946 0.002262 -0.014500
polarizability: 2.55082920e+02 2.54931761e+00 1.84915467e+02 8.08151159e+00 -4.67111116e-01 1.64925941e+02
1716.lowfreq: -20.0998 -15.1218 -4.9226 -2.4701 -0.0007 -0.0006 -0.0004 18.1374 24.9696
frequency: -13.7045 15.6357 24.2105 49.8233 76.3529 78.4718 106.9413 148.7952 164.7905 171.2966 192.0031 197.3547 219.5162 243.9936 249.9460 257.9934 272.9457 281.2337 294.4235 313.0834 328.4514 348.3636 350.3276 371.6994 392.8865 414.6693 433.5569 442.7392 493.7725 515.7307 541.4199 599.6296 616.8266 640.2804 660.7547 715.2804 756.5377 770.5383 785.8247 807.3843 835.9151 839.0332 865.1752 869.7945 896.6219 910.4142 924.7226 930.7886 936.1528 944.4329 946.0548 963.1794 973.0750 982.6172 990.6988 994.6354 1000.2367 1028.6225 1057.2949 1066.3740 1082.4387 1093.3490 1107.3082 1112.9507 1119.6423 1128.7742 1136.0155 1162.3235 1170.7389 1177.6765 1186.6542 1189.2764 1192.6776 1199.6380 1211.8599 1218.0512 1225.5613 1230.0506 1232.2464 1254.6452 1255.6153 1259.2643 1269.7724 1282.2547 1289.2458 1291.5476 1303.9678 1315.0841 1317.9813 1330.7207 1337.1930 1355.0390 1371.3721 1375.1602 1379.3093 1384.3715 1399.0714 1449.5748 1451.0381 1453.2216 1460.1978 1464.6227 1468.0586 1470.7207 1474.4152 1478.1924 1478.7019 1480.1713 1484.6238 1488.9004 1495.6761 1499.0592 1507.3487 2285.7190 2804.7037 2806.1732 2827.7962 2841.8953 2843.4245 2862.5261 2967.1072 2973.2897 2977.4535 2980.2182 2986.6146 2990.3468 2995.7678 2999.3516 3010.7075 3011.7396 3019.8558 3023.1513 3031.1664 3050.8491 3051.9862 3053.6233 3054.5413 3060.5707 3067.9241 3072.3127 3076.9747 3084.7755 3087.9336 3092.9288
redmass: 3.2702 3.3319 3.5194 2.3776 3.6767 2.2282 3.0136 1.4896 1.8825 1.3858 2.4298 1.7751 1.9230 1.9640 2.3265 2.4991 1.9989 1.8748 3.3169 2.1741 2.9458 2.8719 2.7200 2.3941 3.3312 2.1439 3.1230 2.4888 3.0455 3.3725 4.0124 3.4220 3.1042 3.6055 2.9506 3.6184 1.4871 3.3206 1.6403 2.7447 2.4180 1.9269 2.0064 2.6339 2.5951 2.0665 1.9490 1.7539 1.4543 1.8861 1.4891 1.8791 1.6336 1.9520 1.7261 1.5129 1.5334 1.5567 2.7280 2.0130 2.5189 1.6098 1.7927 2.2400 2.1752 2.3522 1.8787 1.9690 2.9025 2.3295 1.2819 1.3308 1.8977 1.3641 1.9100 1.5484 1.2670 1.7079 1.9436 1.4999 1.4128 1.6453 1.5111 1.2119 1.5229 1.3210 1.4786 1.3505 1.8038 1.5746 1.4637 1.4225 1.5005 1.2495 1.2645 1.3612 1.2228 1.0732 1.0794 1.0793 1.0617 1.0821 1.0660 1.0535 1.0832 1.0616 1.0871 1.0793 1.0589 1.0592 1.1036 1.0793 1.0595 11.7783 1.0709 1.0708 1.0715 1.0705 1.0709 1.0706 1.0367 1.0372 1.0400 1.0838 1.0836 1.0626 1.0842 1.0767 1.0802 1.0597 1.0787 1.0700 1.0804 1.0985 1.1000 1.0987 1.0886 1.0977 1.1044 1.0985 1.1017 1.0978 1.0966 1.1054
irintensity: 0.2638 0.0971 0.3698 0.1812 0.9063 1.5236 0.4735 0.7657 1.4978 0.8048 0.1752 0.7881 2.0010 2.5409 2.1478 2.5310 1.5053 0.1799 2.6852 3.9749 5.7528 0.4050 0.1042 0.6554 0.2567 2.2572 0.4440 0.5197 0.6787 0.1851 0.3372 0.7895 2.6504 1.5822 2.0078 1.3617 0.7148 4.2174 4.9635 4.2610 0.9353 8.1156 11.1965 3.4618 6.5031 1.6061 3.9666 3.2168 2.5834 5.2154 0.6088 5.8061 0.4043 2.0718 1.6085 1.1733 2.9149 6.2919 7.9143 3.2219 47.3769 2.4711 5.4181 35.0895 5.6273 15.9587 16.9913 25.6563 11.0963 5.6831 4.5784 1.7032 6.1421 2.5068 5.8187 8.7498 1.5471 1.9885 4.4012 2.0867 17.1734 3.3260 11.4965 5.8642 11.5001 10.3102 9.6164 19.4739 0.3628 27.0125 11.3705 5.8812 26.7166 16.5435 24.3306 16.8653 20.2141 5.5198 5.6282 1.1471 0.7841 2.0415 6.3807 8.2729 11.7347 13.7465 16.1085 1.0371 7.6322 2.9991 3.2380 18.2256 4.2322 0.0508 34.5280 93.7419 76.8780 107.4877 164.3898 130.7323 30.9942 23.1211 65.0020 28.1321 24.5867 41.9813 21.6685 47.8707 32.0814 22.2431 67.1320 61.4922 68.4527 37.3254 4.5835 5.3225 24.8053 64.1767 4.6516 14.5212 67.6762 56.0518 30.5709 71.4827
temp: 298.150 k
press: 1.00000 atm
elementType: 7 7 6 6 6 6 6 6 6 6 6 6 6 6 6 6 6 6 6 6 1 1 1 1 1 1 1 1 1 1 1 1 1 1 1 1 1 1 1 1 1 1 1 1 1 1 1 1 1 1
symmnumber: 1
zpe: 1165450.6 jmol-1
zpe.correction: 0.443897 hartree
zpe.thermalcorrener: 0.464210 hartree
zpe.thermalcorrenthalpy: 0.465155 hartree
zpe.thermalcorrgfe: 0.394557 hartree
zpe.sumelectzpe: -811.738778 hartree
zpe.sumelectthermal: -811.718464 hartree
zpe.sumelectthermalent: -811.717520 hartree
zpe.sumelectthermalfe: -811.788118 hartree
dipole: 0.1090 0.6651 0.2092
dipole: 0.7057
quadrupole: -114.2466 -121.1847 -125.8512
quadrupole: 2.4024 6.1443 0.4968
quadrupole: 6.1809 -0.7572 -5.4237 2.4024 6.1443 0.4968
hfenergy: -812.1826744 hartree
pointgroup: C01 [X(C18H30N2)]
dipole: 0.0390509 0.2688435 0.0572988 debye
polarizability: 254.9237307|4.2569283|184.7495536|8.1580142|-2.2232102|165.2510435 unknown
InChI: InChI=1S/C18H30N2/c1-17(2)16-8-9-18(17,3)15-20(14-16)13-7-6-12-19-10-4-5-11-19/h16H,4-5,8-15H2,1-3H3
charge 0 multiplicity 1
50 atoms
N  -1.194014 -1.040215 -0.043574
N  4.381152 -0.244785 -0.073491
C  -3.619804 -0.407004 0.22168
C  -3.358932 0.998299 -0.462916
C  -1.962892 1.311069 0.181183
C  -3.26981 -0.120469 1.721325
C  -2.190187 1.012402 1.696263
C  -2.592482 -1.438063 -0.332701
C  -0.870878 0.369794 -0.375321
C  -5.041089 -0.972387 0.035817
C  -4.400286 2.064746 -0.022242
C  -3.364266 0.984242 -2.011265
C  -0.220032 -2.015077 -0.589502
C  1.164108 -1.785744 -0.134513
C  2.331672 -1.589646 0.211531
C  3.714666 -1.344755 0.660991
C  5.793614 -0.031219 0.339825
C  3.733375 1.08569 0.056275
C  6.158927 1.355189 -0.263398
C  4.78073 2.036234 -0.56901
H  -1.656392 2.358777 -0.004353
H  -2.882181 -1.031553 2.209538
H  -4.176886 0.19314 2.272188
H  -2.541865 1.916543 2.225987
H  -1.252207 0.683833 2.175354
H  -2.773503 -2.414641 0.161416
H  -2.776337 -1.596129 -1.426683
H  -0.741449 0.527784 -1.47569
H  0.101025 0.610408 0.095985
H  -5.161692 -1.916212 0.601424
H  -5.805581 -0.266114 0.40554
H  -5.262716 -1.190607 -1.026714
H  -4.065489 3.07003 -0.342965
H  -5.383904 1.879181 -0.492285
H  -4.54955 2.09462 1.07032
H  -4.364927 0.704242 -2.392162
H  -3.13434 1.994545 -2.401403
H  -2.633593 0.288139 -2.453793
H  -0.542494 -3.028352 -0.275063
H  -0.223754 -2.017851 -1.713207
H  3.699205 -1.146582 1.767373
H  4.314066 -2.265385 0.515379
H  6.435053 -0.850062 -0.033219
H  5.893722 0.000153 1.456745
H  3.55153 1.352641 1.130648
H  2.761509 1.094868 -0.465791
H  6.748276 1.242062 -1.18894
H  6.763633 1.945614 0.447072
H  4.708796 3.0557 -0.151608
H  4.622075 2.102006 -1.658751
