program: Gaussian 09
title: 000005592
version: EM64L-G09RevD.01
frameworkgroup: C1[X(C15H20O4)]
method: RPBEPBE
basis: SDD
operation: Freq
keyword: #pfreq=noraman
keyword: PBEPBE/SDD
title: #p freq=noraman PBEPBE/SDD
converged: YES YES NO NO
title: Mulliken charges:
elementType: O O O O C C C C C C C C C C C C C C C H H H H H H H H H H H H H H H H H H H H
charge: -0.320296 -0.441204 -0.425042 -0.225114 0.393174 -0.494833 -0.542892 0.281515 -0.076061 -0.533675 -0.753239 0.159167 0.166100 0.232378 -0.077139 0.203670 -0.836772 -0.853884 -0.904843 0.275592 0.202224 0.232391 0.224809 0.227224 0.243877 0.250376 0.234584 0.213596 0.280769 0.217328 0.223855 0.220486 0.224477 0.288750 0.236993 0.274181 0.230101 0.367352 0.380024
chargesum: 0.00000
title: Mulliken charges with hydrogens summed into heavy atoms:
elementType: O O O O C C C C C C C C C C C C C C C
charge: -0.320296 -0.073852 -0.045018 -0.225114 0.393174 -0.017018 -0.085692 0.281515 -0.076061 -0.062575 -0.054682 0.159167 0.166100 0.232378 -0.077139 0.203670 -0.114819 -0.120171 -0.163568
polarizability: 2.10335790e+02 4.32784678e+00 1.92914843e+02 -9.99449625e+00 5.30640807e+00 1.24432202e+02
1716.lowfreq: -0.0008 -0.0004 0.0004 4.1397 8.4601 10.8292 31.6714 44.0821 55.3650
frequency: 31.5870 44.0762 55.3626 82.5128 105.5785 109.1021 119.3886 136.8187 148.9860 161.4886 173.0366 189.9721 206.4869 235.3172 252.9713 273.4582 280.6325 306.9806 333.1112 343.6839 344.5795 369.7015 382.0131 397.5229 419.3727 434.0748 449.9917 472.9865 503.6912 552.1607 564.6612 575.8777 579.8269 610.9322 634.8572 655.5788 698.7499 734.0314 746.2923 806.4148 832.1106 838.0687 871.0129 910.6033 933.8740 944.9101 986.2963 1000.6150 1019.2025 1025.9331 1032.1600 1038.2968 1048.9750 1052.2164 1068.0952 1081.1480 1090.7797 1101.8950 1147.5160 1175.0586 1206.8714 1223.0842 1239.9529 1243.0970 1260.3376 1309.8885 1319.2357 1333.3682 1345.2804 1359.9636 1382.8463 1385.9818 1391.9997 1398.4648 1402.7006 1409.9971 1434.5277 1454.6099 1457.3753 1461.0394 1469.0899 1472.7455 1479.2721 1479.8958 1484.9043 1490.6079 1494.3612 1502.9336 1588.5364 1627.7237 1671.6397 2947.8723 2958.5261 2969.7851 2974.8580 2988.2257 3005.6816 3010.9488 3023.0443 3023.9676 3039.4716 3044.5231 3079.2244 3084.9319 3096.2310 3101.4089 3107.8614 3114.5786 3117.0280 3509.0384 3590.4900
redmass: 5.2957 5.9299 8.7324 2.9719 1.4322 2.6107 1.0533 2.8302 1.6282 1.4217 2.7200 1.6429 2.4092 1.2885 1.9805 2.7095 2.9631 2.7743 2.8931 3.1407 3.3037 2.9593 3.4724 4.7915 2.9613 4.5202 3.0911 4.6750 3.3990 3.3393 4.0688 3.7675 4.0003 1.8722 5.7869 2.4465 2.8846 4.0076 4.7017 2.8200 3.8207 2.4800 3.0858 2.4165 1.7686 1.7110 2.0210 1.8178 2.2001 1.4092 1.7414 1.4952 1.5621 1.9491 2.5210 2.5837 2.1316 2.9530 2.0344 1.5412 1.5206 1.4722 2.5645 1.6484 2.4575 2.1129 1.5463 3.8594 2.0609 1.4725 3.9434 1.2188 1.2774 1.2743 1.4079 2.5870 1.0875 1.4984 1.1024 1.0868 1.1948 1.1610 1.2574 1.0710 1.0610 1.0744 1.4998 1.0504 7.2661 7.2074 8.4139 1.0425 1.0668 1.0410 1.0402 1.0367 1.0648 1.0975 1.0846 1.0668 1.0958 1.0975 1.0990 1.0989 1.1010 1.1003 1.0913 1.0955 1.0948 1.0638 1.0652
irintensity: 0.4986 0.7915 1.2519 0.9198 1.4635 0.4098 1.5448 0.4770 0.3156 1.1620 1.8318 0.0847 0.9686 88.4942 24.2361 5.0138 1.5052 2.1174 2.5226 4.1142 6.2079 2.0355 1.4312 2.9714 0.5061 9.8592 2.4432 0.3809 29.2876 11.5431 20.1715 5.5567 1.9260 37.0720 10.7213 124.2700 6.1017 7.0585 1.9861 24.0627 17.8438 6.6960 28.4392 5.8596 12.1484 3.6497 13.3538 5.2407 2.8185 3.6261 75.4171 3.7330 0.2697 127.7352 99.4656 103.4264 34.2284 10.6028 129.6135 44.5403 127.0797 11.8883 14.6448 37.7369 38.0041 36.1394 3.0147 4.2063 10.1110 21.1884 34.2724 28.0650 7.3825 29.3320 50.2784 43.5638 13.8495 4.8952 7.0060 16.2184 2.0655 7.7295 34.1411 33.3910 20.7881 9.0089 17.9831 0.3369 1.5794 0.8436 230.8804 48.0741 35.2326 38.4244 36.4358 16.5845 31.7775 22.7501 27.3572 19.7534 21.1701 21.8735 10.6558 26.6689 11.8632 17.9695 10.3994 6.2038 2.5624 20.2968 30.6801
temp: 298.150 k
press: 1.00000 atm
elementType: 8 8 8 8 6 6 6 6 6 6 6 6 6 6 6 6 6 6 6 1 1 1 1 1 1 1 1 1 1 1 1 1 1 1 1 1 1 1 1
symmnumber: 1
zpe: 839136.5 jmol-1
zpe.correction: 0.319610 hartree
zpe.thermalcorrener: 0.339781 hartree
zpe.thermalcorrenthalpy: 0.340726 hartree
zpe.thermalcorrgfe: 0.271650 hartree
zpe.sumelectzpe: -883.070108 hartree
zpe.sumelectthermal: -883.049937 hartree
zpe.sumelectthermalent: -883.048993 hartree
zpe.sumelectthermalfe: -883.118068 hartree
dipole: 0.3105 -1.3729 0.3537
dipole: 1.4514
quadrupole: -110.2806 -111.0922 -108.0719
quadrupole: 18.1604 0.4934 -2.2926
quadrupole: -0.4657 -1.2773 1.7430 18.1604 0.4934 -2.2926
hfenergy: -883.3897184 hartree
pointgroup: C01 [X(C15H20O4)]
dipole: 0.0901597 0.5412782 -0.1579195 debye
polarizability: 210.0326397|-2.8053974|192.7709462|12.838771|3.1326953|124.8792494 unknown
InChI: InChI=1S/C15H20O4/c1-8-9(2)14-11(10(3)13(8)18)5-6-15(4,19-14)7-12(16)17/h16,18H,5-7H2,1-4H3
charge 0 multiplicity 1
39 atoms
O  -1.094737 -0.596838 -0.472485
O  4.315569 0.555036 0.551041
O  -3.580926 -0.220131 1.736391
O  -3.75578 -2.221728 0.581372
C  -2.021887 0.510862 -0.852788
C  -1.7834 1.712419 0.089439
C  -0.327635 2.216349 -0.003071
C  0.68159 1.075642 0.011023
C  0.262419 -0.260111 -0.218702
C  -3.431637 -0.127843 -0.688095
C  -1.791031 0.868812 -2.3370
C  2.056092 1.339096 0.260134
C  1.16453 -1.358966 -0.177694
C  2.534652 -1.095791 0.086563
C  2.954736 0.248275 0.29034
C  -3.591388 -0.984788 0.55478
C  2.557145 2.751508 0.498061
C  0.647255 -2.770088 -0.406568
C  3.569609 -2.2083 0.156369
H  -2.012914 1.393524 1.120233
H  -2.486724 2.526353 -0.17001
H  -0.127553 2.89964 0.843647
H  -0.188789 2.83026 -0.917392
H  -4.185429 0.680186 -0.675894
H  -3.633855 -0.789782 -1.545826
H  -0.771633 1.256999 -2.498556
H  -1.916049 -0.028129 -2.967786
H  -2.512106 1.638236 -2.670071
H  3.656326 2.768444 0.535032
H  2.22247 3.441001 -0.299797
H  2.180065 3.159516 1.45688
H  1.142276 -3.25031 -1.272207
H  0.825838 -3.415474 0.47452
H  -0.435521 -2.75525 -0.596961
H  4.055423 -2.258668 1.152717
H  3.117266 -3.194112 -0.025322
H  4.368806 -2.08259 -0.604115
H  4.865216 -0.265697 0.514562
H  -3.670687 -0.83566 2.514235
