program: Gaussian 09
title: 000005587
version: EM64L-G09RevD.01
frameworkgroup: C1[X(C16H21N3)]
method: RPBEPBE
basis: SDD
operation: Freq
keyword: #pfreq=noraman
keyword: PBEPBE/SDD
title: #p freq=noraman PBEPBE/SDD
converged: YES YES NO NO
title: Mulliken charges:
elementType: N N N C C C C C C C C C C C C C C C C H H H H H H H H H H H H H H H H H H H H H
charge: -0.141467 -0.075148 -0.103461 -0.423555 -0.362950 -0.565044 0.234042 0.513490 -0.618602 -0.614460 -0.452585 -0.369603 -0.311975 -0.219516 -0.230390 -0.193160 -0.244287 -0.362271 -0.217936 0.226898 0.253743 0.215694 0.209169 0.206878 0.282085 0.226219 0.187858 0.226319 0.223053 0.189918 0.227295 0.228663 0.257168 0.235383 0.223356 0.223823 0.228793 0.226539 0.232784 0.227240
chargesum: 0.00000
title: Mulliken charges with hydrogens summed into heavy atoms:
elementType: N N N C C C C C C C C C C C C C C C C
charge: -0.141467 -0.075148 -0.103461 0.057087 0.061913 -0.076081 0.234042 0.513490 0.021794 0.025805 -0.223921 -0.112435 -0.076592 0.003840 -0.006567 0.035634 -0.017748 -0.129487 0.009304
polarizability: 2.10054869e+02 3.02705536e+01 2.33948598e+02 1.70467869e+00 1.11830926e+01 1.39675365e+02
1716.lowfreq: -9.2370 -3.2152 -0.0003 -0.0001 0.0005 9.8073 18.9427 25.1113 31.3180
frequency: 18.7755 23.8325 30.8276 39.2702 45.1852 57.3747 114.1104 129.6205 156.1680 182.0251 215.9044 223.2669 238.8978 249.3649 300.7897 324.3494 348.9063 375.1971 403.2069 413.4630 419.8047 436.1263 458.2129 513.3786 534.2123 574.2862 609.0225 618.1240 627.5007 704.5980 728.8241 742.2544 767.0849 771.4426 791.8537 807.8932 824.5896 844.0243 853.8929 907.1945 943.1881 945.1206 949.9673 975.1741 976.1989 989.7505 993.7125 997.1571 1015.4034 1027.0195 1033.2403 1040.0158 1056.7820 1075.9383 1087.1985 1090.7424 1094.7755 1137.6278 1151.8860 1170.6581 1171.4178 1185.8602 1200.8321 1214.0255 1243.4259 1255.4482 1265.7823 1295.8906 1308.8463 1321.1337 1326.7916 1336.3344 1353.6263 1376.6321 1383.1567 1392.7488 1419.8735 1425.8692 1441.5735 1443.0559 1455.9033 1462.2066 1465.1709 1473.8933 1475.9523 1481.4617 1483.2704 1485.8611 1498.2117 1548.7483 1594.4343 1598.2475 1613.9566 2845.9866 2850.6858 2868.3195 2971.7368 3002.3411 3019.6537 3023.8622 3028.1337 3052.7239 3068.5071 3078.1978 3083.8346 3110.6251 3120.0732 3123.0769 3133.4482 3135.4458 3146.7405 3161.8378 3165.2847 3176.7497
redmass: 3.2835 3.9537 3.3605 3.8030 4.3829 3.9180 2.2255 4.4960 3.8445 3.9897 1.3375 1.7011 4.0730 1.4048 2.8913 3.1100 2.7723 2.1296 2.8058 3.3697 2.7754 2.3973 3.0723 2.8405 4.8292 4.2203 5.6544 6.2476 5.1053 1.7926 1.6979 2.2963 2.4259 3.1708 1.2652 3.6642 4.2196 1.3679 1.2487 1.4972 1.4316 5.6103 2.2890 1.3232 1.3919 5.7642 1.5294 1.9763 2.8232 2.1727 1.5935 2.3503 2.4771 1.6668 1.6196 1.3817 1.6167 1.5663 1.8911 1.0868 1.0699 1.1110 2.4067 2.6643 1.5789 1.5261 2.5241 1.2084 1.7540 1.3394 1.3621 3.7101 1.3630 1.3426 4.2085 2.3559 1.1646 2.0503 1.9220 1.2254 1.1740 1.0516 1.1065 1.2360 1.1057 1.5552 1.3913 1.2831 1.4447 5.3995 6.1323 5.9504 6.0697 1.0580 1.0647 1.0612 1.0653 1.0632 1.0728 1.0841 1.0733 1.0956 1.1027 1.1011 1.1007 1.0874 1.0892 1.0859 1.0888 1.0913 1.0959 1.1015 1.0928 1.1001
irintensity: 0.3392 0.0830 0.4090 0.2865 0.3773 1.1355 0.9692 2.4854 1.0351 1.1027 1.9745 0.3900 0.5206 1.3268 2.2990 2.3451 16.0489 8.8759 0.1779 4.1656 5.8512 0.9201 5.9193 9.0064 4.5692 9.2360 9.5737 0.4719 4.0711 51.2186 28.7328 31.0570 62.7247 10.2930 6.2317 9.6231 15.4644 0.1126 0.0895 13.0117 0.7880 8.4332 48.0973 0.1231 0.0564 0.7972 4.4233 11.8240 24.6367 6.6535 21.9642 9.4150 28.3922 21.9390 1.0009 7.8866 1.1500 9.8654 13.4440 4.8798 1.7895 2.8603 25.4131 18.1311 58.1048 15.2831 9.7503 12.9784 6.3375 16.2134 0.3667 30.3799 14.3918 3.2420 4.1338 9.1833 5.5666 29.2823 25.3896 5.0223 32.0908 9.4614 14.0071 49.8563 59.6252 35.6959 5.1352 31.5065 112.9156 33.1690 41.1550 304.3217 7.9888 65.9179 78.3459 196.7316 57.5143 17.9399 41.7678 34.7646 37.0708 24.1743 14.6100 31.8225 55.3451 10.2818 29.1267 0.1174 11.7390 19.4512 36.3047 26.1605 32.9071 15.8714
temp: 298.150 k
press: 1.00000 atm
elementType: 7 7 7 6 6 6 6 6 6 6 6 6 6 6 6 6 6 6 6 1 1 1 1 1 1 1 1 1 1 1 1 1 1 1 1 1 1 1 1 1
symmnumber: 1
zpe: 887290.1 jmol-1
zpe.correction: 0.337951 hartree
zpe.thermalcorrener: 0.356444 hartree
zpe.thermalcorrenthalpy: 0.357388 hartree
zpe.thermalcorrgfe: 0.288059 hartree
zpe.sumelectzpe: -785.118319 hartree
zpe.sumelectthermal: -785.099825 hartree
zpe.sumelectthermalent: -785.098881 hartree
zpe.sumelectthermalfe: -785.168211 hartree
dipole: 2.0224 -1.3964 0.6268
dipole: 2.5363
quadrupole: -105.6289 -108.7792 -113.1503
quadrupole: 0.9913 0.6995 5.7040
quadrupole: 3.5572 0.4070 -3.9642 0.9913 0.6995 5.7040
hfenergy: -785.4562695 hartree
pointgroup: C01 [X(C16H21N3)]
dipole: 0.8594854 0.3863978 -0.3281732 debye
polarizability: 198.7792693|-21.9564113|244.3070751|-5.714909|15.1305846|140.5924881 unknown
InChI: InChI=1S/C16H21N3/c1-18(2)12-13-19(16-10-6-7-11-17-16)14-15-8-4-3-5-9-15/h3-11H,12-14H2,1-2H3
charge 0 multiplicity 1
40 atoms
N  0.337762 -0.28995 0.303051
N  2.967525 2.3813 -0.439947
N  -0.122226 -2.558645 0.766333
C  1.019731 0.790541 -0.427671
C  2.344433 1.229801 0.250777
C  -0.675618 0.105829 1.307567
C  0.639623 -1.633571 0.087287
C  -1.938803 0.7048 0.694395
C  3.584094 2.019585 -1.733183
C  3.912198 3.116868 0.426556
C  -2.402904 1.982905 1.090305
C  -2.681331 -0.026011 -0.269486
C  1.687488 -2.050118 -0.801448
C  -3.589441 2.523434 0.540986
C  -3.864203 0.511088 -0.820958
C  1.910092 -3.424342 -0.99024
C  -4.323318 1.788454 -0.416982
C  0.126827 -3.881206 0.573022
C  1.120656 -4.377047 -0.297189
H  1.194282 0.479176 -1.473669
H  0.345533 1.663978 -0.469738
H  2.110532 1.537782 1.287371
H  3.038094 0.353156 0.324238
H  -0.224362 0.834409 2.011116
H  -0.924865 -0.811591 1.86875
H  2.833733 1.580062 -2.412279
H  4.428462 1.290311 -1.626575
H  3.978434 2.929177 -2.220022
H  4.27431 4.017378 -0.101642
H  4.805639 2.512854 0.728366
H  3.395752 3.446238 1.34551
H  -1.834482 2.557919 1.832838
H  -2.326316 -1.016621 -0.575901
H  2.316575 -1.320576 -1.317256
H  -3.936372 3.514448 0.855464
H  -4.431651 -0.064221 -1.561586
H  2.705493 -3.753232 -1.66869
H  -5.241744 2.205195 -0.845874
H  -0.510415 -4.566263 1.145714
H  1.272686 -5.452695 -0.42051
