program: Gaussian 09
title: 000039491
version: EM64L-G09RevD.01
frameworkgroup: C1[X(C8H12N2O)]
method: RPBEPBE
basis: SDD
operation: Freq
keyword: #p
keyword: freq=noraman
keyword: PBEPBE/SDD
title: #p freq=noraman PBEPBE/SDD
converged: YES YES NO NO
title: Mulliken charges:
elementType: O N N C C C C C C C C H H H H H H H H H H H H
charge: -0.453765 -0.163768 -0.615774 -0.360012 0.435048 -0.333653 -0.363172 -0.404374 -0.224281 -0.207598 -0.266393 0.230500 0.206296 0.211448 0.179670 0.235222 0.221205 0.222605 0.221807 0.305594 0.315939 0.228680 0.378776
chargesum: 0.00000
title: Mulliken charges with hydrogens summed into heavy atoms:
elementType: O N N C C C C C C C C
charge: -0.074990 -0.163768 0.005759 0.076783 0.435048 0.057466 -0.127949 -0.183169 -0.001676 0.014209 -0.037713
polarizability: 1.50009428e+02 5.62872535e-01 1.06880738e+02 1.82347322e+00 1.72980718e+00 5.75051573e+01
1716.lowfreq: -14.5464 -0.0002 -0.0002 0.0002 6.5137 14.6960 49.7862 73.6908 129.2433
frequency: 49.7199 73.6551 129.2227 163.9664 197.3823 259.2324 296.7295 357.2499 402.0423 422.3287 428.9483 463.5277 512.8707 589.1830 613.5473 691.2503 711.7633 756.4895 792.7223 816.2326 846.7184 871.2516 879.1781 940.0545 957.9954 968.9136 979.0184 979.6790 1032.1512 1053.8660 1076.2911 1090.7233 1172.5917 1184.8193 1198.7642 1217.4112 1243.1829 1253.9092 1323.2075 1326.8342 1348.6776 1357.3120 1387.5946 1427.6854 1446.0817 1459.4310 1464.2862 1489.2291 1581.3120 1616.7165 1657.1960 2932.1565 2944.5342 3033.0927 3062.4549 3124.3897 3131.8761 3148.5920 3163.1143 3175.0650 3257.7674 3339.6968 3469.8744
redmass: 5.2346 3.2532 3.6089 4.1804 2.9522 4.5657 2.7064 3.5327 1.6985 1.5857 3.3571 3.5287 2.8207 3.0004 6.3542 1.9002 4.0046 1.8522 1.2581 1.2589 1.2628 1.8703 2.1626 2.9352 1.3855 2.5892 3.6487 1.3378 2.1358 2.7143 2.1040 1.6419 1.0676 1.4345 1.1227 1.4074 1.2540 1.6549 2.5052 1.3610 1.3531 1.3920 4.8246 1.1939 2.3669 1.1437 1.0875 2.3064 6.0766 5.6491 1.0968 1.0691 1.0654 1.0950 1.0934 1.0846 1.0882 1.0929 1.0960 1.0975 1.0641 1.0457 1.0957
irintensity: 4.2196 0.6459 24.9313 3.1696 7.2550 8.8658 3.6737 2.7083 4.4842 6.3858 0.6622 11.1475 18.2345 6.5679 0.3536 40.4022 19.3216 93.6213 38.0714 10.2149 228.7002 2.2848 16.1980 5.7017 1.1612 50.7111 51.6227 3.7194 10.3269 67.4374 5.1374 6.1889 1.3544 14.1230 2.6133 32.0691 24.9372 15.0517 53.1254 0.6481 26.4841 3.5695 11.7656 118.1877 6.6182 71.5705 6.7131 90.6782 7.1877 122.2905 13.8403 34.1424 97.7653 32.1766 58.5575 7.2668 7.3293 29.8781 34.1288 6.2646 245.9356 8.4419 4.1721
temp: 298.150 k
press: 1.00000 atm
elementType: 8 7 7 6 6 6 6 6 6 6 6 1 1 1 1 1 1 1 1 1 1 1 1
symmnumber: 1
zpe: 504481.7 jmol-1
zpe.correction: 0.192147 hartree
zpe.thermalcorrener: 0.202544 hartree
zpe.thermalcorrenthalpy: 0.203488 hartree
zpe.thermalcorrgfe: 0.155956 hartree
zpe.sumelectzpe: -495.889729 hartree
zpe.sumelectthermal: -495.879332 hartree
zpe.sumelectthermalent: -495.878388 hartree
zpe.sumelectthermalfe: -495.925919 hartree
dipole: -2.3997 0.8734 0.6768
dipole: 2.6418
quadrupole: -81.8561 -53.8622 -69.5676
quadrupole: -0.9729 4.9274 0.0978
quadrupole: -13.4275 14.5665 -1.1390 -0.9729 4.9274 0.0978
hfenergy: -496.0818755 hartree
pointgroup: C01 [X(C8H12N2O1)]
dipole: -0.949567 0.2496711 0.3409777 debye
dipolederiv: -0.7919623 -0.0908939 -0.050534 -0.0709252 -0.6588375 0.0861486 -0.0232743 0.0769654 -0.548578 -1.2879232 -0.0554358 -0.0792613 0.225999 -0.0397298 -0.0166908 -0.4770429 -0.0012887 -0.3527021 -0.7148729 0.0663139 0.0559161 0.1605626 -0.0169843 -0.0371774 0.2689502 -0.0255539 0.0034193 0.2298111 -0.2182389 -0.1181395 -0.4906908 0.2436368 0.0727008 -0.1732328 0.1014873 0.328623 1.4401446 0.0658575 0.1244329 0.1150211 -0.122722 -0.0224938 0.2275628 -0.0495461 0.1219617 0.3900269 0.1073373 -0.0197189 0.148347 0.522218 -0.1343711 0.0648834 -0.1044341 0.419706 -0.3789971 0.0207437 0.0018484 -0.3767589 -0.0432707 0.0598486 -0.1212382 0.0682054 -0.19926 -0.4520077 -0.090514 -0.0240937 0.2724724 -0.0421015 0.0998646 0.0754544 0.0994516 -0.2053849 0.2113369 -0.1006777 -0.008783 0.0294038 0.1489433 0.1085646 0.0256018 0.1035969 -0.0934055 0.2137225 0.0882347 0.0443861 -0.0300624 0.158286 0.1094852 0.0122447 0.1148175 -0.089671 -0.1047841 0.0141392 0.017956 0.0105973 -0.2776569 -0.0157201 0.01403 -0.0292466 -0.2232064 -0.0224097 0.0272192 -0.026648 0.1297 0.0251844 0.0092524 0.0918295 -0.0722424 -0.1869754 0.035104 -0.1090673 0.0403651 -0.0253731 -0.1110273 0.0433371 0.0581154 0.0377515 0.0470005 -0.0379469 0.09518 0.0211753 0.0946268 -0.1076852 -0.0149424 0.0565397 -0.0682432 0.0732026 0.0395714 -0.0490944 0.0485906 -0.0636538 0.0137435 -0.0045889 -0.0167183 0.0649129 -0.2573015 0.0274086 0.0992703 0.0322636 0.1011075 -0.0006689 -0.0644192 0.0403143 -0.0603189 0.1396138 0.057771 -0.0903712 -0.0462417 -0.0675952 -0.0382067 -0.0864183 -0.0465515 -0.0897049 0.125589 0.0431079 -0.0699087 -0.0312756 -0.0857215 -0.062285 -0.0884458 -0.0459095 -0.0858839 0.1166841 0.0027639 0.0943204 0.0301312 0.1117809 -0.0384674 -0.069877 0.0408695 -0.0657718 0.1296583 0.2504022 0.1377413 -0.1086962 -0.0641034 0.0149445 0.0199262 -0.056686 0.0357427 0.1188478 0.3269108 0.0936395 0.1007638 -0.0401206 0.0733387 -0.0371183 0.0504859 -0.0401685 0.0783009 -0.1355023 -0.0141496 -0.0217412 -0.01234 0.0961074 -0.0325141 -0.0256837 -0.0301971 0.1648698 0.6583245 -0.0216454 0.0173041 -0.0722734 0.2632408 0.015649 -0.0405444 0.0196688 0.2890077 unknown
polarizability: 149.9645443|0.3428096|102.3243253|2.5870799|14.4216378|62.1064534 unknown
InChI: InChI=1S/C8H12N2O/c9-10(6-7-11)8-4-2-1-3-5-8/h1-5,11H,6-7,9H2
charge 0 multiplicity 1
23 atoms
O  3.905503 0.395927 -0.370467
N  0.883504 0.139755 0.209407
N  1.465409 1.451728 0.283406
C  1.790172 -0.924318 -0.285469
C  -0.522614 0.03636 0.06209
C  3.233577 -0.755639 0.225594
C  -1.131791 -1.15397 -0.440745
C  -1.372027 1.124075 0.429712
C  -2.534094 -1.24783 -0.549593
C  -2.772845 1.014111 0.309312
C  -3.37066 -0.170206 -0.178032
H  1.802732 -0.956907 -1.397723
H  1.400434 -1.892187 0.082266
H  3.821306 -1.64305 -0.066881
H  3.222762 -0.693512 1.336847
H  -0.519144 -2.000827 -0.760503
H  -0.945261 2.049765 0.829487
H  -2.974515 -2.172629 -0.940052
H  -3.400349 1.863262 0.604297
H  1.060359 2.094599 -0.419015
H  1.383482 1.842177 1.232546
H  -4.458519 -0.250011 -0.269775
H  3.252479 1.146128 -0.205507
