program: Gaussian 09
title: 000039496
version: EM64L-G09RevD.01
frameworkgroup: C1[X(C13H19NO3)]
method: RPBEPBE
basis: SDD
operation: Freq
keyword: #p
keyword: freq=noraman
keyword: PBEPBE/SDD
title: #p freq=noraman PBEPBE/SDD
converged: YES YES NO NO
title: Mulliken charges:
elementType: O O O N C C C C C C C C C C C C C H H H H H H H H H H H H H H H H H H H
charge: -0.422552 -0.300063 -0.289929 -0.561243 -0.090205 -0.413700 -0.599634 -0.395906 -0.593074 0.268788 0.506308 -0.044187 -0.677757 0.037530 0.231626 -0.518381 -0.525637 0.235182 0.171070 0.236834 0.163257 0.219405 0.202640 0.216464 0.196492 0.225249 0.260762 0.259767 0.258878 0.340678 0.217273 0.225015 0.257595 0.266754 0.224179 0.210521
chargesum: 0.00000
title: Mulliken charges with hydrogens summed into heavy atoms:
elementType: O O O N C C C C C C C C C C C C C
charge: -0.081874 -0.300063 -0.289929 -0.042597 0.144977 -0.005796 -0.216973 0.023198 -0.171332 0.268788 0.506308 -0.044187 -0.416995 0.037530 0.231626 0.181502 0.175817
polarizability: 2.14533366e+02 -1.21864908e+00 1.68048834e+02 8.35876739e+00 2.28108329e+00 1.03602433e+02
1716.lowfreq: -8.1185 -0.0007 0.0002 0.0007 6.4841 11.1044 49.7577 59.3130 84.0752
frequency: 49.7065 59.1795 84.0380 94.7861 104.8087 119.2302 154.2639 172.2420 183.1286 211.4749 217.1947 253.4128 274.1985 281.0650 304.1954 311.2383 324.6318 330.7510 339.3637 378.0402 393.0037 419.1116 434.8170 484.5357 496.4842 536.5463 546.2529 567.7696 600.5241 614.3523 663.8560 709.6633 755.0194 789.6098 831.6470 833.1827 870.7894 884.0499 906.3837 922.4386 928.0036 964.7667 996.3815 1012.9970 1057.7398 1071.1491 1093.1345 1108.3966 1111.6244 1112.8266 1123.0892 1147.9596 1154.5392 1158.7567 1188.7730 1194.3377 1204.2894 1219.9458 1234.9259 1267.1489 1284.2584 1303.5586 1322.5686 1329.4639 1338.7124 1349.8754 1370.4529 1379.5906 1405.7671 1422.0752 1438.5836 1455.3343 1457.2083 1462.9758 1464.5162 1465.2623 1481.0643 1482.8450 1487.9153 1490.0785 1573.0344 1613.4018 1636.2655 2934.2028 2941.6989 2955.8931 2970.5283 2975.7980 2976.1678 2981.5197 3001.8121 3033.0283 3037.0826 3045.2051 3078.4892 3080.8347 3120.5101 3124.0395 3151.6479 3439.9770 3563.0042 3569.3197
redmass: 3.9474 3.3467 2.6427 3.0102 3.6874 2.8284 1.3496 1.3536 2.0099 2.5603 3.4651 1.2664 3.7337 3.7723 3.0328 4.0979 2.2989 1.4773 2.2791 3.4475 4.0932 4.2631 2.3820 2.2172 4.0619 3.8582 4.2876 1.6402 3.9203 3.8035 5.6333 3.9714 4.0764 3.3134 1.7641 2.6917 1.5667 2.4066 2.9213 4.0571 2.6240 3.8738 2.9511 1.7710 2.4410 2.4710 3.8360 1.8275 1.2523 1.2848 1.7099 1.3720 1.3418 1.4430 1.6530 1.9092 1.6316 1.7720 1.2844 1.2121 1.4417 1.8908 1.3273 1.7183 1.4675 1.6679 2.6408 2.1520 2.6562 1.2700 1.3801 1.0915 1.0624 1.0976 1.1391 1.1025 1.2284 1.0556 1.0546 2.3844 8.6231 7.0890 1.0954 1.0625 1.0676 1.0659 1.0346 1.0518 1.0411 1.0925 1.0889 1.0992 1.0944 1.0961 1.0974 1.1014 1.1038 1.1047 1.0917 1.0443 1.0649 1.0977
irintensity: 0.3703 1.8199 4.9361 6.6182 0.6438 2.2397 2.3220 0.3924 6.0885 1.2491 0.4302 34.0917 10.8908 4.6551 7.8259 8.9868 5.6235 64.7186 31.8318 8.7716 2.8512 6.1346 3.7384 6.8917 4.1184 16.2479 1.7012 289.0386 28.9080 12.4164 4.7305 4.8084 3.6518 0.2758 11.4219 24.6422 12.3803 14.9392 17.3776 29.3368 20.1429 29.3736 94.9285 10.9098 30.9566 41.1891 28.2619 26.6616 16.7392 0.2706 0.6578 30.7327 2.6557 15.1161 161.8118 88.3464 18.6072 6.3407 6.0030 3.4635 2.7038 42.1531 5.0668 14.0017 18.4693 16.3435 3.2713 13.1138 59.1685 0.1406 17.7018 9.9057 6.8843 11.4311 23.2919 3.7959 26.8533 15.8998 16.5322 97.6094 33.6214 31.1765 46.7759 58.2931 41.4120 35.6092 96.1410 100.9833 19.1830 11.9625 42.8985 49.6292 39.3638 50.6667 34.0127 30.4775 21.9283 18.3734 4.8438 2.0691 22.1792 0.1881
temp: 298.150 k
press: 1.00000 atm
elementType: 8 8 8 7 6 6 6 6 6 6 6 6 6 6 6 6 6 1 1 1 1 1 1 1 1 1 1 1 1 1 1 1 1 1 1 1
symmnumber: 1
zpe: 788658.1 jmol-1
zpe.correction: 0.300384 hartree
zpe.thermalcorrener: 0.318038 hartree
zpe.thermalcorrenthalpy: 0.318982 hartree
zpe.thermalcorrgfe: 0.256047 hartree
zpe.sumelectzpe: -785.848496 hartree
zpe.sumelectthermal: -785.830842 hartree
zpe.sumelectthermalent: -785.829898 hartree
zpe.sumelectthermalfe: -785.892833 hartree
dipole: -2.0601 1.5158 -1.0550
dipole: 2.7667
quadrupole: -98.1469 -93.7778 -103.8383
quadrupole: -0.3920 7.8229 -5.9461
quadrupole: 0.4408 4.8099 -5.2507 -0.3920 7.8229 -5.9461
hfenergy: -786.1488802 hartree
pointgroup: C01 [X(C13H19N1O3)]
dipole: 0.7746155 0.6209552 0.4463522 debye
polarizability: 213.7360682|2.8496214|168.2322618|11.9610975|-1.2123782|104.216303 unknown
InChI: InChI=1S/C13H19NO3/c1-16-11-6-8-4-3-5-9(14)7-10(8)12(15)13(11)17-2/h6,9,15H,3-5,7,14H2,1-2H3
charge 0 multiplicity 1
36 atoms
O  -0.616613 2.379759 -0.087515
O  -3.005712 1.00486 -0.422763
O  -3.053532 -1.848163 -0.039555
N  4.060153 1.775785 -0.536164
C  3.025974 0.721829 -0.456209
C  3.751663 -0.622007 -0.207968
C  1.930389 1.009775 0.638267
C  2.875751 -1.895183 -0.201531
C  1.788396 -1.948185 0.910296
C  0.608916 0.27874 0.445567
C  0.539868 -1.137764 0.588828
C  -0.579946 0.978956 0.098304
C  -0.686366 -1.805201 0.387315
C  -1.826737 0.313986 -0.071985
C  -1.866113 -1.099264 0.060192
C  -3.485338 1.997098 0.564321
C  -3.842334 -1.693798 -1.28161
H  2.518917 0.680547 -1.440418
H  4.281226 -0.548764 0.768638
H  4.534002 -0.717942 -0.983987
H  1.790489 2.112132 0.669674
H  2.363045 0.754537 1.628438
H  3.552325 -2.763144 -0.070803
H  2.387383 -2.022749 -1.187515
H  2.243446 -1.604378 1.86368
H  1.491762 -3.00105 1.069318
H  -0.755672 -2.89301 0.486073
H  4.672717 1.820347 0.285984
H  3.714224 2.701482 -0.809361
H  0.289414 2.758629 0.033736
H  -3.678978 1.507332 1.537729
H  -4.425747 2.387818 0.145761
H  -2.750235 2.810855 0.681894
H  -4.131086 -0.641292 -1.43486
H  -4.73075 -2.327529 -1.136118
H  -3.259102 -2.059144 -2.149553
